{
  "label": "no_label",
  "outdir": "/home/isaac.legred/lwp/Examples",
  "sampler": null,
  "log_evidence": NaN,
  "log_evidence_err": NaN,
  "log_noise_evidence": NaN,
  "log_bayes_factor": NaN,
  "priors": {
    "chirp_mass": {
      "__prior__": true,
      "__module__": "bilby.gw.prior",
      "__name__": "UniformInComponentsChirpMass",
      "kwargs": {
        "minimum": 1.485,
        "maximum": 1.49,
        "name": "chirp_mass",
        "latex_label": "$\\mathcal{M}$",
        "unit": "$M_{\\odot}$",
        "boundary": null
      }
    },
    "mass_ratio": {
      "__prior__": true,
      "__module__": "bilby.gw.prior",
      "__name__": "UniformInComponentsMassRatio",
      "kwargs": {
        "minimum": 0.125,
        "maximum": 1,
        "name": "mass_ratio",
        "latex_label": "$q$",
        "unit": null,
        "boundary": null
      }
    },
    "mass_1": {
      "__prior__": true,
      "__module__": "bilby.core.prior.base",
      "__name__": "Constraint",
      "kwargs": {
        "minimum": 1.001398,
        "maximum": 5.31215532473869,
        "name": "mass_1",
        "latex_label": "$m_1$",
        "unit": null
      }
    },
    "mass_2": {
      "__prior__": true,
      "__module__": "bilby.core.prior.base",
      "__name__": "Constraint",
      "kwargs": {
        "minimum": 1.001398,
        "maximum": 5.31215532473869,
        "name": "mass_2",
        "latex_label": "$m_2$",
        "unit": null
      }
    },
    "a_1": {
      "__prior__": true,
      "__module__": "bilby.core.prior.analytical",
      "__name__": "Uniform",
      "kwargs": {
        "minimum": 0.0,
        "maximum": 0.89,
        "name": "a_1",
        "latex_label": "$a_1$",
        "unit": null,
        "boundary": null
      }
    },
    "a_2": {
      "__prior__": true,
      "__module__": "bilby.core.prior.analytical",
      "__name__": "Uniform",
      "kwargs": {
        "minimum": 0.0,
        "maximum": 0.89,
        "name": "a_2",
        "latex_label": "$a_2$",
        "unit": null,
        "boundary": null
      }
    },
    "tilt_1": {
      "__prior__": true,
      "__module__": "bilby.core.prior.analytical",
      "__name__": "Sine",
      "kwargs": {
        "minimum": 0,
        "maximum": 3.141592653589793,
        "name": "tilt_1",
        "latex_label": "$\\theta_1$",
        "unit": null,
        "boundary": null
      }
    },
    "tilt_2": {
      "__prior__": true,
      "__module__": "bilby.core.prior.analytical",
      "__name__": "Sine",
      "kwargs": {
        "minimum": 0,
        "maximum": 3.141592653589793,
        "name": "tilt_2",
        "latex_label": "$\\theta_2$",
        "unit": null,
        "boundary": null
      }
    },
    "phi_12": {
      "__prior__": true,
      "__module__": "bilby.core.prior.analytical",
      "__name__": "Uniform",
      "kwargs": {
        "minimum": 0,
        "maximum": 6.283185307179586,
        "name": "phi_12",
        "latex_label": "$\\Delta\\phi$",
        "unit": null,
        "boundary": "periodic"
      }
    },
    "phi_jl": {
      "__prior__": true,
      "__module__": "bilby.core.prior.analytical",
      "__name__": "Uniform",
      "kwargs": {
        "minimum": 0,
        "maximum": 6.283185307179586,
        "name": "phi_jl",
        "latex_label": "$\\phi_{JL}$",
        "unit": null,
        "boundary": "periodic"
      }
    },
    "lambda_1": {
      "__prior__": true,
      "__module__": "bilby.core.prior.analytical",
      "__name__": "Uniform",
      "kwargs": {
        "minimum": 0,
        "maximum": 5000,
        "name": "lambda_1",
        "latex_label": "$\\Lambda_1$",
        "unit": null,
        "boundary": null
      }
    },
    "lambda_2": {
      "__prior__": true,
      "__module__": "bilby.core.prior.analytical",
      "__name__": "Uniform",
      "kwargs": {
        "minimum": 0,
        "maximum": 10000,
        "name": "lambda_2",
        "latex_label": "$\\Lambda_2$",
        "unit": null,
        "boundary": null
      }
    },
    "luminosity_distance": {
      "__prior__": true,
      "__module__": "bilby.core.prior.analytical",
      "__name__": "PowerLaw",
      "kwargs": {
        "alpha": 2,
        "minimum": 1,
        "maximum": 500,
        "name": "luminosity_distance",
        "latex_label": "$d_L$",
        "unit": "Mpc",
        "boundary": null
      }
    },
    "theta_jn": {
      "__prior__": true,
      "__module__": "bilby.core.prior.analytical",
      "__name__": "Sine",
      "kwargs": {
        "minimum": 0,
        "maximum": 3.141592653589793,
        "name": "theta_jn",
        "latex_label": "$\\theta_{JN}$",
        "unit": null,
        "boundary": null
      }
    },
    "psi": {
      "__prior__": true,
      "__module__": "bilby.core.prior.analytical",
      "__name__": "Uniform",
      "kwargs": {
        "minimum": 0,
        "maximum": 3.141592653589793,
        "name": "psi",
        "latex_label": "$\\psi$",
        "unit": null,
        "boundary": "periodic"
      }
    },
    "phase": {
      "__prior__": true,
      "__module__": "bilby.core.prior.analytical",
      "__name__": "Uniform",
      "kwargs": {
        "minimum": 0,
        "maximum": 6.283185307179586,
        "name": "phase",
        "latex_label": "$\\phi$",
        "unit": null,
        "boundary": "periodic"
      }
    },
    "geocent_time": {
      "__prior__": true,
      "__module__": "bilby.core.prior.analytical",
      "__name__": "Uniform",
      "kwargs": {
        "minimum": 1240215502.917,
        "maximum": 1240215503.117,
        "name": "geocent_time",
        "latex_label": "$t_c$",
        "unit": null,
        "boundary": null
      }
    },
    "azimuth": {
      "__prior__": true,
      "__module__": "bilby.core.prior.analytical",
      "__name__": "Uniform",
      "kwargs": {
        "minimum": 0,
        "maximum": 6.283185307179586,
        "name": null,
        "latex_label": "$\\epsilon$",
        "unit": null,
        "boundary": "periodic"
      }
    },
    "zenith": {
      "__prior__": true,
      "__module__": "bilby.core.prior.analytical",
      "__name__": "Sine",
      "kwargs": {
        "minimum": 0,
        "maximum": 3.141592653589793,
        "name": null,
        "latex_label": "$\\kappa$",
        "unit": null,
        "boundary": null
      }
    },
    "'geocent'_time": {
      "__prior__": true,
      "__module__": "bilby.core.prior.analytical",
      "__name__": "Uniform",
      "kwargs": {
        "minimum": 1240215502.917,
        "maximum": 1240215503.1169999,
        "name": "'geocent'_time",
        "latex_label": "$t_'$",
        "unit": "$s$",
        "boundary": null
      }
    },
    "recalib_L1_amplitude_0": {
      "__prior__": true,
      "__module__": "bilby.core.prior.analytical",
      "__name__": "Gaussian",
      "kwargs": {
        "mu": -0.0028558578327391305,
        "sigma": 0.027605536270954883,
        "name": "recalib_L1_amplitude_0",
        "latex_label": "$A^L1_0$",
        "unit": null,
        "boundary": "reflective"
      }
    },
    "recalib_L1_amplitude_1": {
      "__prior__": true,
      "__module__": "bilby.core.prior.analytical",
      "__name__": "Gaussian",
      "kwargs": {
        "mu": 0.001651734319826111,
        "sigma": 0.02251996645144827,
        "name": "recalib_L1_amplitude_1",
        "latex_label": "$A^L1_1$",
        "unit": null,
        "boundary": "reflective"
      }
    },
    "recalib_L1_amplitude_2": {
      "__prior__": true,
      "__module__": "bilby.core.prior.analytical",
      "__name__": "Gaussian",
      "kwargs": {
        "mu": -0.0023041985840077652,
        "sigma": 0.05525988061939583,
        "name": "recalib_L1_amplitude_2",
        "latex_label": "$A^L1_2$",
        "unit": null,
        "boundary": "reflective"
      }
    },
    "recalib_L1_amplitude_3": {
      "__prior__": true,
      "__module__": "bilby.core.prior.analytical",
      "__name__": "Gaussian",
      "kwargs": {
        "mu": -0.003312280048991354,
        "sigma": 0.01582925955176909,
        "name": "recalib_L1_amplitude_3",
        "latex_label": "$A^L1_3$",
        "unit": null,
        "boundary": "reflective"
      }
    },
    "recalib_L1_amplitude_4": {
      "__prior__": true,
      "__module__": "bilby.core.prior.analytical",
      "__name__": "Gaussian",
      "kwargs": {
        "mu": -0.003793904203463883,
        "sigma": 0.021359294220955435,
        "name": "recalib_L1_amplitude_4",
        "latex_label": "$A^L1_4$",
        "unit": null,
        "boundary": "reflective"
      }
    },
    "recalib_L1_amplitude_5": {
      "__prior__": true,
      "__module__": "bilby.core.prior.analytical",
      "__name__": "Gaussian",
      "kwargs": {
        "mu": 0.0025749991300339776,
        "sigma": 0.014546714040597408,
        "name": "recalib_L1_amplitude_5",
        "latex_label": "$A^L1_5$",
        "unit": null,
        "boundary": "reflective"
      }
    },
    "recalib_L1_amplitude_6": {
      "__prior__": true,
      "__module__": "bilby.core.prior.analytical",
      "__name__": "Gaussian",
      "kwargs": {
        "mu": 0.0001926829564178718,
        "sigma": 0.011089091637445026,
        "name": "recalib_L1_amplitude_6",
        "latex_label": "$A^L1_6$",
        "unit": null,
        "boundary": "reflective"
      }
    },
    "recalib_L1_amplitude_7": {
      "__prior__": true,
      "__module__": "bilby.core.prior.analytical",
      "__name__": "Gaussian",
      "kwargs": {
        "mu": 0.0023602920467605606,
        "sigma": 0.012232858016692548,
        "name": "recalib_L1_amplitude_7",
        "latex_label": "$A^L1_7$",
        "unit": null,
        "boundary": "reflective"
      }
    },
    "recalib_L1_amplitude_8": {
      "__prior__": true,
      "__module__": "bilby.core.prior.analytical",
      "__name__": "Gaussian",
      "kwargs": {
        "mu": 0.006386333378408844,
        "sigma": 0.01976452141060428,
        "name": "recalib_L1_amplitude_8",
        "latex_label": "$A^L1_8$",
        "unit": null,
        "boundary": "reflective"
      }
    },
    "recalib_L1_amplitude_9": {
      "__prior__": true,
      "__module__": "bilby.core.prior.analytical",
      "__name__": "Gaussian",
      "kwargs": {
        "mu": 0.011668064024293727,
        "sigma": 0.03571817577030382,
        "name": "recalib_L1_amplitude_9",
        "latex_label": "$A^L1_9$",
        "unit": null,
        "boundary": "reflective"
      }
    },
    "recalib_L1_phase_0": {
      "__prior__": true,
      "__module__": "bilby.core.prior.analytical",
      "__name__": "Gaussian",
      "kwargs": {
        "mu": 0.0019816449890329452,
        "sigma": 0.011832668799737078,
        "name": "recalib_L1_phase_0",
        "latex_label": "$\\phi^L1_0$",
        "unit": null,
        "boundary": "reflective"
      }
    },
    "recalib_L1_phase_1": {
      "__prior__": true,
      "__module__": "bilby.core.prior.analytical",
      "__name__": "Gaussian",
      "kwargs": {
        "mu": -0.0019963158658347245,
        "sigma": 0.03894708513467675,
        "name": "recalib_L1_phase_1",
        "latex_label": "$\\phi^L1_1$",
        "unit": null,
        "boundary": "reflective"
      }
    },
    "recalib_L1_phase_2": {
      "__prior__": true,
      "__module__": "bilby.core.prior.analytical",
      "__name__": "Gaussian",
      "kwargs": {
        "mu": -0.003828188082447193,
        "sigma": 0.023696289651614393,
        "name": "recalib_L1_phase_2",
        "latex_label": "$\\phi^L1_2$",
        "unit": null,
        "boundary": "reflective"
      }
    },
    "recalib_L1_phase_3": {
      "__prior__": true,
      "__module__": "bilby.core.prior.analytical",
      "__name__": "Gaussian",
      "kwargs": {
        "mu": 3.882704610243957e-05,
        "sigma": 0.03426862096349826,
        "name": "recalib_L1_phase_3",
        "latex_label": "$\\phi^L1_3$",
        "unit": null,
        "boundary": "reflective"
      }
    },
    "recalib_L1_phase_4": {
      "__prior__": true,
      "__module__": "bilby.core.prior.analytical",
      "__name__": "Gaussian",
      "kwargs": {
        "mu": 0.006324591036573659,
        "sigma": 0.025203312311422147,
        "name": "recalib_L1_phase_4",
        "latex_label": "$\\phi^L1_4$",
        "unit": null,
        "boundary": "reflective"
      }
    },
    "recalib_L1_phase_5": {
      "__prior__": true,
      "__module__": "bilby.core.prior.analytical",
      "__name__": "Gaussian",
      "kwargs": {
        "mu": 0.006251064780818085,
        "sigma": 0.0068255050712528464,
        "name": "recalib_L1_phase_5",
        "latex_label": "$\\phi^L1_5$",
        "unit": null,
        "boundary": "reflective"
      }
    },
    "recalib_L1_phase_6": {
      "__prior__": true,
      "__module__": "bilby.core.prior.analytical",
      "__name__": "Gaussian",
      "kwargs": {
        "mu": 0.008705038766493737,
        "sigma": 0.008453503771444234,
        "name": "recalib_L1_phase_6",
        "latex_label": "$\\phi^L1_6$",
        "unit": null,
        "boundary": "reflective"
      }
    },
    "recalib_L1_phase_7": {
      "__prior__": true,
      "__module__": "bilby.core.prior.analytical",
      "__name__": "Gaussian",
      "kwargs": {
        "mu": 0.01440978575434744,
        "sigma": 0.010076226817583148,
        "name": "recalib_L1_phase_7",
        "latex_label": "$\\phi^L1_7$",
        "unit": null,
        "boundary": "reflective"
      }
    },
    "recalib_L1_phase_8": {
      "__prior__": true,
      "__module__": "bilby.core.prior.analytical",
      "__name__": "Gaussian",
      "kwargs": {
        "mu": 0.021189928237928674,
        "sigma": 0.018679499446871202,
        "name": "recalib_L1_phase_8",
        "latex_label": "$\\phi^L1_8$",
        "unit": null,
        "boundary": "reflective"
      }
    },
    "recalib_L1_phase_9": {
      "__prior__": true,
      "__module__": "bilby.core.prior.analytical",
      "__name__": "Gaussian",
      "kwargs": {
        "mu": 0.02827071356523382,
        "sigma": 0.034993841255993745,
        "name": "recalib_L1_phase_9",
        "latex_label": "$\\phi^L1_9$",
        "unit": null,
        "boundary": "reflective"
      }
    },
    "recalib_L1_frequency_0": {
      "__prior__": true,
      "__module__": "bilby.core.prior.analytical",
      "__name__": "DeltaFunction",
      "kwargs": {
        "peak": 19.398437499999996,
        "name": "recalib_L1_frequency_0",
        "latex_label": "$f^L1_0$",
        "unit": null
      }
    },
    "recalib_L1_frequency_1": {
      "__prior__": true,
      "__module__": "bilby.core.prior.analytical",
      "__name__": "DeltaFunction",
      "kwargs": {
        "peak": 32.55420587990222,
        "name": "recalib_L1_frequency_1",
        "latex_label": "$f^L1_1$",
        "unit": null
      }
    },
    "recalib_L1_frequency_2": {
      "__prior__": true,
      "__module__": "bilby.core.prior.analytical",
      "__name__": "DeltaFunction",
      "kwargs": {
        "peak": 54.63204551763824,
        "name": "recalib_L1_frequency_2",
        "latex_label": "$f^L1_2$",
        "unit": null
      }
    },
    "recalib_L1_frequency_3": {
      "__prior__": true,
      "__module__": "bilby.core.prior.analytical",
      "__name__": "DeltaFunction",
      "kwargs": {
        "peak": 91.68278926699048,
        "name": "recalib_L1_frequency_3",
        "latex_label": "$f^L1_3$",
        "unit": null
      }
    },
    "recalib_L1_frequency_4": {
      "__prior__": true,
      "__module__": "bilby.core.prior.analytical",
      "__name__": "DeltaFunction",
      "kwargs": {
        "peak": 153.86086623942262,
        "name": "recalib_L1_frequency_4",
        "latex_label": "$f^L1_4$",
        "unit": null
      }
    },
    "recalib_L1_frequency_5": {
      "__prior__": true,
      "__module__": "bilby.core.prior.analytical",
      "__name__": "DeltaFunction",
      "kwargs": {
        "peak": 258.2073074915575,
        "name": "recalib_L1_frequency_5",
        "latex_label": "$f^L1_5$",
        "unit": null
      }
    },
    "recalib_L1_frequency_6": {
      "__prior__": true,
      "__module__": "bilby.core.prior.analytical",
      "__name__": "DeltaFunction",
      "kwargs": {
        "peak": 433.32015002627855,
        "name": "recalib_L1_frequency_6",
        "latex_label": "$f^L1_6$",
        "unit": null
      }
    },
    "recalib_L1_frequency_7": {
      "__prior__": true,
      "__module__": "bilby.core.prior.analytical",
      "__name__": "DeltaFunction",
      "kwargs": {
        "peak": 727.1922481316136,
        "name": "recalib_L1_frequency_7",
        "latex_label": "$f^L1_7$",
        "unit": null
      }
    },
    "recalib_L1_frequency_8": {
      "__prior__": true,
      "__module__": "bilby.core.prior.analytical",
      "__name__": "DeltaFunction",
      "kwargs": {
        "peak": 1220.3645865779388,
        "name": "recalib_L1_frequency_8",
        "latex_label": "$f^L1_8$",
        "unit": null
      }
    },
    "recalib_L1_frequency_9": {
      "__prior__": true,
      "__module__": "bilby.core.prior.analytical",
      "__name__": "DeltaFunction",
      "kwargs": {
        "peak": 2048.0,
        "name": "recalib_L1_frequency_9",
        "latex_label": "$f^L1_9$",
        "unit": null
      }
    },
    "recalib_V1_amplitude_0": {
      "__prior__": true,
      "__module__": "bilby.core.prior.analytical",
      "__name__": "Gaussian",
      "kwargs": {
        "mu": 0.0,
        "sigma": 0.05000000000000005,
        "name": "recalib_V1_amplitude_0",
        "latex_label": "$A^V1_0$",
        "unit": null,
        "boundary": "reflective"
      }
    },
    "recalib_V1_amplitude_1": {
      "__prior__": true,
      "__module__": "bilby.core.prior.analytical",
      "__name__": "Gaussian",
      "kwargs": {
        "mu": 0.0,
        "sigma": 0.05000000000000006,
        "name": "recalib_V1_amplitude_1",
        "latex_label": "$A^V1_1$",
        "unit": null,
        "boundary": "reflective"
      }
    },
    "recalib_V1_amplitude_2": {
      "__prior__": true,
      "__module__": "bilby.core.prior.analytical",
      "__name__": "Gaussian",
      "kwargs": {
        "mu": 0.0,
        "sigma": 0.05000000000000003,
        "name": "recalib_V1_amplitude_2",
        "latex_label": "$A^V1_2$",
        "unit": null,
        "boundary": "reflective"
      }
    },
    "recalib_V1_amplitude_3": {
      "__prior__": true,
      "__module__": "bilby.core.prior.analytical",
      "__name__": "Gaussian",
      "kwargs": {
        "mu": 0.0,
        "sigma": 0.050000000000000044,
        "name": "recalib_V1_amplitude_3",
        "latex_label": "$A^V1_3$",
        "unit": null,
        "boundary": "reflective"
      }
    },
    "recalib_V1_amplitude_4": {
      "__prior__": true,
      "__module__": "bilby.core.prior.analytical",
      "__name__": "Gaussian",
      "kwargs": {
        "mu": 0.0,
        "sigma": 0.05000000000000005,
        "name": "recalib_V1_amplitude_4",
        "latex_label": "$A^V1_4$",
        "unit": null,
        "boundary": "reflective"
      }
    },
    "recalib_V1_amplitude_5": {
      "__prior__": true,
      "__module__": "bilby.core.prior.analytical",
      "__name__": "Gaussian",
      "kwargs": {
        "mu": 0.0,
        "sigma": 0.050000000000000044,
        "name": "recalib_V1_amplitude_5",
        "latex_label": "$A^V1_5$",
        "unit": null,
        "boundary": "reflective"
      }
    },
    "recalib_V1_amplitude_6": {
      "__prior__": true,
      "__module__": "bilby.core.prior.analytical",
      "__name__": "Gaussian",
      "kwargs": {
        "mu": 0.0,
        "sigma": 0.05000000000000003,
        "name": "recalib_V1_amplitude_6",
        "latex_label": "$A^V1_6$",
        "unit": null,
        "boundary": "reflective"
      }
    },
    "recalib_V1_amplitude_7": {
      "__prior__": true,
      "__module__": "bilby.core.prior.analytical",
      "__name__": "Gaussian",
      "kwargs": {
        "mu": 0.0,
        "sigma": 0.050000000000000044,
        "name": "recalib_V1_amplitude_7",
        "latex_label": "$A^V1_7$",
        "unit": null,
        "boundary": "reflective"
      }
    },
    "recalib_V1_amplitude_8": {
      "__prior__": true,
      "__module__": "bilby.core.prior.analytical",
      "__name__": "Gaussian",
      "kwargs": {
        "mu": 0.0,
        "sigma": 0.05000000000000005,
        "name": "recalib_V1_amplitude_8",
        "latex_label": "$A^V1_8$",
        "unit": null,
        "boundary": "reflective"
      }
    },
    "recalib_V1_amplitude_9": {
      "__prior__": true,
      "__module__": "bilby.core.prior.analytical",
      "__name__": "Gaussian",
      "kwargs": {
        "mu": 0.0,
        "sigma": 0.05000000000000005,
        "name": "recalib_V1_amplitude_9",
        "latex_label": "$A^V1_9$",
        "unit": null,
        "boundary": "reflective"
      }
    },
    "recalib_V1_phase_0": {
      "__prior__": true,
      "__module__": "bilby.core.prior.analytical",
      "__name__": "Gaussian",
      "kwargs": {
        "mu": 0.0,
        "sigma": 0.035021216036861036,
        "name": "recalib_V1_phase_0",
        "latex_label": "$\\phi^V1_0$",
        "unit": null,
        "boundary": "reflective"
      }
    },
    "recalib_V1_phase_1": {
      "__prior__": true,
      "__module__": "bilby.core.prior.analytical",
      "__name__": "Gaussian",
      "kwargs": {
        "mu": 0.0,
        "sigma": 0.03505971801521732,
        "name": "recalib_V1_phase_1",
        "latex_label": "$\\phi^V1_1$",
        "unit": null,
        "boundary": "reflective"
      }
    },
    "recalib_V1_phase_2": {
      "__prior__": true,
      "__module__": "bilby.core.prior.analytical",
      "__name__": "Gaussian",
      "kwargs": {
        "mu": 0.0,
        "sigma": 0.035167925724425265,
        "name": "recalib_V1_phase_2",
        "latex_label": "$\\phi^V1_2$",
        "unit": null,
        "boundary": "reflective"
      }
    },
    "recalib_V1_phase_3": {
      "__prior__": true,
      "__module__": "bilby.core.prior.analytical",
      "__name__": "Gaussian",
      "kwargs": {
        "mu": 0.0,
        "sigma": 0.03547089662689944,
        "name": "recalib_V1_phase_3",
        "latex_label": "$\\phi^V1_3$",
        "unit": null,
        "boundary": "reflective"
      }
    },
    "recalib_V1_phase_4": {
      "__prior__": true,
      "__module__": "bilby.core.prior.analytical",
      "__name__": "Gaussian",
      "kwargs": {
        "mu": 0.0,
        "sigma": 0.036310575129658434,
        "name": "recalib_V1_phase_4",
        "latex_label": "$\\phi^V1_4$",
        "unit": null,
        "boundary": "reflective"
      }
    },
    "recalib_V1_phase_5": {
      "__prior__": true,
      "__module__": "bilby.core.prior.analytical",
      "__name__": "Gaussian",
      "kwargs": {
        "mu": 0.0,
        "sigma": 0.03857727925326856,
        "name": "recalib_V1_phase_5",
        "latex_label": "$\\phi^V1_5$",
        "unit": null,
        "boundary": "reflective"
      }
    },
    "recalib_V1_phase_6": {
      "__prior__": true,
      "__module__": "bilby.core.prior.analytical",
      "__name__": "Gaussian",
      "kwargs": {
        "mu": 0.0,
        "sigma": 0.04434266429211259,
        "name": "recalib_V1_phase_6",
        "latex_label": "$\\phi^V1_6$",
        "unit": null,
        "boundary": "reflective"
      }
    },
    "recalib_V1_phase_7": {
      "__prior__": true,
      "__module__": "bilby.core.prior.analytical",
      "__name__": "Gaussian",
      "kwargs": {
        "mu": 0.0,
        "sigma": 0.05755564565924887,
        "name": "recalib_V1_phase_7",
        "latex_label": "$\\phi^V1_7$",
        "unit": null,
        "boundary": "reflective"
      }
    },
    "recalib_V1_phase_8": {
      "__prior__": true,
      "__module__": "bilby.core.prior.analytical",
      "__name__": "Gaussian",
      "kwargs": {
        "mu": 0.0,
        "sigma": 0.08428807508005823,
        "name": "recalib_V1_phase_8",
        "latex_label": "$\\phi^V1_8$",
        "unit": null,
        "boundary": "reflective"
      }
    },
    "recalib_V1_phase_9": {
      "__prior__": true,
      "__module__": "bilby.core.prior.analytical",
      "__name__": "Gaussian",
      "kwargs": {
        "mu": 0.0,
        "sigma": 0.13335459814461123,
        "name": "recalib_V1_phase_9",
        "latex_label": "$\\phi^V1_9$",
        "unit": null,
        "boundary": "reflective"
      }
    },
    "recalib_V1_frequency_0": {
      "__prior__": true,
      "__module__": "bilby.core.prior.analytical",
      "__name__": "DeltaFunction",
      "kwargs": {
        "peak": 19.398437499999996,
        "name": "recalib_V1_frequency_0",
        "latex_label": "$f^V1_0$",
        "unit": null
      }
    },
    "recalib_V1_frequency_1": {
      "__prior__": true,
      "__module__": "bilby.core.prior.analytical",
      "__name__": "DeltaFunction",
      "kwargs": {
        "peak": 32.55420587990222,
        "name": "recalib_V1_frequency_1",
        "latex_label": "$f^V1_1$",
        "unit": null
      }
    },
    "recalib_V1_frequency_2": {
      "__prior__": true,
      "__module__": "bilby.core.prior.analytical",
      "__name__": "DeltaFunction",
      "kwargs": {
        "peak": 54.63204551763824,
        "name": "recalib_V1_frequency_2",
        "latex_label": "$f^V1_2$",
        "unit": null
      }
    },
    "recalib_V1_frequency_3": {
      "__prior__": true,
      "__module__": "bilby.core.prior.analytical",
      "__name__": "DeltaFunction",
      "kwargs": {
        "peak": 91.68278926699048,
        "name": "recalib_V1_frequency_3",
        "latex_label": "$f^V1_3$",
        "unit": null
      }
    },
    "recalib_V1_frequency_4": {
      "__prior__": true,
      "__module__": "bilby.core.prior.analytical",
      "__name__": "DeltaFunction",
      "kwargs": {
        "peak": 153.86086623942262,
        "name": "recalib_V1_frequency_4",
        "latex_label": "$f^V1_4$",
        "unit": null
      }
    },
    "recalib_V1_frequency_5": {
      "__prior__": true,
      "__module__": "bilby.core.prior.analytical",
      "__name__": "DeltaFunction",
      "kwargs": {
        "peak": 258.2073074915575,
        "name": "recalib_V1_frequency_5",
        "latex_label": "$f^V1_5$",
        "unit": null
      }
    },
    "recalib_V1_frequency_6": {
      "__prior__": true,
      "__module__": "bilby.core.prior.analytical",
      "__name__": "DeltaFunction",
      "kwargs": {
        "peak": 433.32015002627855,
        "name": "recalib_V1_frequency_6",
        "latex_label": "$f^V1_6$",
        "unit": null
      }
    },
    "recalib_V1_frequency_7": {
      "__prior__": true,
      "__module__": "bilby.core.prior.analytical",
      "__name__": "DeltaFunction",
      "kwargs": {
        "peak": 727.1922481316136,
        "name": "recalib_V1_frequency_7",
        "latex_label": "$f^V1_7$",
        "unit": null
      }
    },
    "recalib_V1_frequency_8": {
      "__prior__": true,
      "__module__": "bilby.core.prior.analytical",
      "__name__": "DeltaFunction",
      "kwargs": {
        "peak": 1220.3645865779388,
        "name": "recalib_V1_frequency_8",
        "latex_label": "$f^V1_8$",
        "unit": null
      }
    },
    "recalib_V1_frequency_9": {
      "__prior__": true,
      "__module__": "bilby.core.prior.analytical",
      "__name__": "DeltaFunction",
      "kwargs": {
        "peak": 2048.0,
        "name": "recalib_V1_frequency_9",
        "latex_label": "$f^V1_9$",
        "unit": null
      }
    },
    "__prior_dict__": true,
    "__module__": "bilby.gw.prior",
    "__name__": "BNSPriorDict"
  },
  "posterior": {
    "__dataframe__": true,
    "content": {
      "mass_1_source": [
        1.776151718641746,
        2.1051280443920364,
        2.3487620686011583,
        1.6659643957318993,
        2.5759279166208513,
        2.139870147922367,
        2.122468148109611,
        2.3632122749562807,
        2.1151364032912214,
        2.6302596771175466,
        1.8915567751400522,
        2.1948143779895557,
        2.1867571273027906,
        1.8409350230725923,
        1.7898848803869518,
        2.312397895705311,
        1.6742677093158047,
        1.8681677967753136,
        1.8947644913379538,
        1.9850024214803177,
        2.113478583443233,
        2.3032403528833902,
        1.759076811530002,
        2.17356963400259,
        1.8172850159661988,
        1.918269479036719,
        2.518848065475837,
        1.791176409468459,
        2.510325444180561,
        2.453035400492963,
        2.432681725565316,
        1.8976260187601581,
        2.180005278123693,
        1.7987357336009109,
        2.2796483699690926,
        2.528016057423546,
        2.47031867283324,
        2.174263405690947,
        2.209611188533419,
        1.7339453779304415,
        2.223422820482413,
        1.9847046831094568,
        2.017405806659608,
        2.501079246420851,
        2.4596992979011794,
        1.9932946566081842,
        1.891401638728905,
        1.8639349318810516,
        2.2878060692058715,
        2.394881947401109,
        2.2069845197790343,
        2.400559419878113,
        1.951557035886322,
        1.8474774998664385,
        2.1314645107004933,
        2.226656219117818,
        2.012847944345941,
        2.111372238672888,
        2.503375188217607,
        2.582453395582596,
        1.94256004267936,
        1.679633077205532,
        1.7022191813141343,
        2.222141736095902,
        1.8008978848169472,
        1.7099714654963833,
        2.440320179065959,
        2.3829963328706927,
        1.7224699229256262,
        1.7535535048786814,
        2.47470395735462,
        1.9863949703795676,
        1.788219463346396,
        2.640431284420001,
        2.1737832788757743,
        2.105227243348804,
        1.9832661300203636,
        2.4552345489357776,
        1.8673304352382802,
        2.3058597842306914,
        2.1382929504987453,
        1.7409484583587842,
        1.8948453740016635,
        2.332048023375257,
        2.323165698310433,
        2.0191167449801823,
        1.9308451521946173,
        1.8408109382614337,
        2.487049455422998,
        1.9064669518061121,
        1.6898152560323765,
        1.6758329224988522,
        2.3290874743673515,
        1.8853231984212437,
        1.8102814595961925,
        2.2716128278023735,
        1.6649671239737909,
        2.2022548641912567,
        2.2272614565459583,
        1.791353849018633,
        2.1539613792152568,
        2.107430478494676,
        1.8218679462739191,
        2.0015785222753433,
        1.767466997916385,
        2.545848441037905,
        2.4815017244014297,
        2.201231055018694,
        1.8515462220219798,
        2.3866397961967256,
        2.51781966341723,
        1.8368326747173125,
        1.985566041331718,
        2.4250215532302217,
        1.8089638865321638,
        2.2323457156048336,
        2.311743935732439,
        2.3905176145382,
        1.7868920723414736,
        2.361186533891626,
        2.0524856386146606,
        1.9683903533535727,
        1.7810935703644326,
        1.7368183216190278,
        2.3213428088955017,
        1.8779568794605213,
        2.500486137517916,
        1.862149090411194,
        2.2159848273068588,
        2.3363507891757416,
        2.060913169676687,
        2.2417698300368207,
        2.360530059364929,
        2.5486876467532764,
        2.0555725919500296,
        2.4217629023774387,
        2.0913043368998308,
        1.8307931709094551,
        2.280097996289462,
        2.61591050736432,
        2.5820230340806667,
        2.5617720887227846,
        1.9314745406632428,
        2.6474102948510385,
        1.769194844326722,
        2.0910613184944395,
        2.3153839600994153,
        1.8364318247667344,
        2.3765505630119774,
        2.006174194126577,
        1.6555800983197533,
        2.319705467374411,
        2.468513272910598,
        2.322504970947377,
        2.054277029868884,
        1.8697620376726023,
        1.9469180069524934,
        2.0014985274115826,
        2.5318865661354137,
        1.753652555990075,
        2.164589745694067,
        2.5238822396710465,
        2.4564003256224263,
        2.2448043119925294,
        1.9913026601769386,
        2.2190718315667866,
        2.321879057809476,
        1.891229515835516,
        1.940780447569108,
        1.8005565039466833,
        1.8135768299748316,
        1.6223220024652392,
        2.5840594268848722,
        2.5533557521236427,
        2.026511071265666,
        1.8826461937888874,
        2.1154427461437715,
        2.4158232539781874,
        2.0091777649035567,
        3.0017778874036667,
        2.206668878641286,
        2.0843280401414828,
        2.4892221228470546,
        2.5330525021313592,
        1.8691582987904671,
        1.6663929429502236,
        1.7737891633504732,
        1.795781764410383,
        1.966499061504355,
        2.206690255617073,
        1.9575645785310156,
        1.8844310043717518,
        1.8615788292201996,
        2.3162990512832655,
        2.5132569816967503,
        2.2182510890865768,
        1.6630104481206256,
        1.843273270688476,
        1.7824161207000133,
        2.3606399077301283,
        2.175883846325463,
        2.181598715478103,
        2.4352613416612376,
        1.7877076640659517,
        1.7751572081346183,
        2.2721512548754874,
        2.238043228917124,
        2.2497641307088085,
        2.3958551442450875,
        2.3334929906098294,
        1.6941412599700294,
        1.916814406555882,
        1.9106102608310003,
        1.9048735396901983,
        2.067761789006648,
        1.8261595574399716,
        2.2485980061462465,
        1.6772711372694415,
        1.9085743854514863,
        2.0875182573510016,
        2.431624644138448,
        2.4341940436314258,
        2.4171393182165457,
        2.461323362428159,
        2.2345544050081636,
        2.320001307828115,
        1.7754837074867564,
        1.8085260905450147,
        2.096423489929028,
        1.833563339652429,
        2.169016431457222,
        2.191861950278558,
        1.783148932749212,
        2.322923136603542,
        1.702878616678587,
        2.1994347774271983,
        2.3933595199791715,
        2.5130407998973023,
        1.9026469617784785,
        1.7068911788289902,
        2.453250758428508,
        2.5514776442245752,
        2.1594202824225603,
        2.1357621708415793,
        2.1694805568820725,
        1.7465032563595946,
        2.499214977962959,
        1.9930117579613518,
        2.453158792177404,
        2.3683206024056767,
        1.8851170795694205,
        1.7809000153814674,
        1.6609354076499134,
        1.714153362829305,
        2.642754385322262,
        2.033012982604998,
        1.8967242741182742,
        2.146245562437212,
        1.8804920916883985,
        1.91802952610939,
        1.896273745685076,
        2.2285080563815867,
        1.8607533327316004,
        2.000236253330695,
        2.1658052306886946,
        2.0205791327713123,
        2.3599047428366817,
        2.287102141630953,
        1.7009806807644925,
        1.9386554112630323,
        2.162668683979746,
        1.8244924203736652,
        1.8274141942269957,
        2.5179480471160867,
        2.156463014976895,
        1.8671237976024786,
        1.9959811061116293,
        2.4789292557016043,
        2.56136042502401,
        2.4911800700768523,
        2.190005072435506,
        2.2600395342180937,
        1.8275223690350808,
        2.016258656090537,
        1.9863602652809071,
        1.8540852752111225,
        1.8861676035602037,
        2.0319109063592413,
        1.9825405467082302,
        1.8766926066300769,
        2.345724734905818,
        1.7739925808711723,
        1.8458139803068359,
        2.035194858981925,
        2.110555564926573,
        2.7272979313923438,
        1.8142251542107708,
        1.6870330249659913,
        1.796613148078739,
        2.2607924483509225,
        2.066904415322286,
        1.932538720865913,
        1.8758492193722593,
        1.8003738873856048,
        2.430240188795809,
        2.4817887030743,
        1.901846893632798,
        2.422417427200794,
        2.425862745326098,
        2.0362676576996086,
        2.060234205685532,
        1.784713045500956,
        2.5283987114206696,
        2.1757997169171137,
        1.7848264304656762,
        2.17099735900057,
        2.0766054921985395,
        1.7686518415229255,
        2.3212328506620197,
        2.1082119434745517,
        2.065792551730237,
        2.120409759990832,
        2.594407956707259,
        2.5374386832886957,
        2.25322842573328,
        1.8642926262264294,
        1.8095841027533597,
        2.270053475396731,
        2.2265652639034057,
        2.365122748192534,
        1.7832518571095317,
        2.440018389289082,
        1.9301973634768863,
        1.7515297543453252,
        2.213643408283697,
        2.2785135130327663,
        1.9136437112122382,
        2.2106821707487563,
        1.8305045726213767,
        2.324902049899869,
        1.9509400625026807,
        2.4204316950786713,
        1.8165852121890287,
        2.0513184003956484,
        1.8073970604221472,
        1.8911381520565524,
        1.860282179833794,
        2.395338311897501,
        1.9127163036307122,
        2.215950972082164,
        2.2628493529842486,
        2.2460265940067714,
        1.91422621798205,
        2.147160272713912,
        1.6835002815596631,
        1.7908612648578877,
        2.233965508904417,
        2.5163734090638052,
        1.8832798647132718,
        2.1148127335709535,
        2.597005638634141,
        1.7919623490099619,
        1.8781878349295458,
        1.9367417516729184,
        1.760459130800827,
        1.7948627299249458,
        1.941121627817513,
        1.7713799789592406,
        1.8776283807048109,
        2.176131908126806,
        1.7942578234950162,
        2.5344791451188655,
        2.4425294537113005,
        1.898827827922404,
        1.6755029474924872,
        2.5301697959342917,
        2.369685662215822,
        1.971237615088909,
        2.1046736602972858,
        1.9440574757509692,
        1.7300863938964897,
        1.8168740183154175,
        2.1861108181121374,
        1.8068930316448049,
        2.4881079067139837,
        1.9206307179044293,
        2.17981062722739,
        2.5135146065448697,
        1.6676654373259419,
        2.3961278998072375,
        2.23794355645627,
        2.613911822190022,
        2.503755540716052,
        1.9481583872068775,
        2.523700803034457,
        2.349387428300962,
        1.8453355637279598,
        2.395277323243304,
        2.2678003158591276,
        1.7383110818230512,
        1.692869155331779,
        1.7909109590142798,
        2.093564188679504,
        1.9489378990007442,
        1.9226744917794178,
        1.9081600499778713,
        1.7043968847708533,
        2.8493918405503,
        2.386066025068914,
        1.9621880869974386,
        1.7836060040947728,
        1.9318917461179126,
        1.9207963086647786,
        1.980362671268754,
        1.7860299229410561,
        2.4868308014258638,
        2.7515102000293274,
        2.324780678126518,
        2.345869697464147,
        1.8464542625145983,
        1.9268897398555764,
        2.1829516063632153,
        2.016781860444064,
        1.727055275113129,
        1.9308185232345794,
        1.9736489864438218,
        1.9337012298827065,
        1.7643003774198516,
        1.8089689295995202,
        2.4763821536451727,
        2.178484000400713,
        2.1547844484586385,
        1.8661022128456197,
        1.6304740045846118,
        2.6477214029718663,
        1.8501455204940465,
        2.5502580816269798,
        2.5040329106831694,
        2.483129966215269,
        2.196386013166539,
        2.3472229818988395,
        2.4139763036015025,
        2.218986934952937,
        2.253330429893888,
        2.1906277303479347,
        1.71598751396599,
        1.796594986794732,
        1.7303637329148724,
        2.0928424392249902,
        2.591055519663324,
        2.6836971647004075,
        2.1040773663535193,
        1.884418891189381,
        2.4551790889419074,
        2.2771324913035604,
        2.3273147872343642,
        2.0436041259412483,
        2.0988111566888565,
        2.5414363439171668,
        1.8105589483533775,
        1.9225156657987608,
        2.034332881208982,
        2.506675670580918,
        2.173044753940673,
        2.6038525981104588,
        2.478778720787027,
        1.8023235958400718,
        1.946946096551075,
        2.514329866702436,
        2.25067421458921,
        2.587603460573588,
        1.8255566350857964,
        2.006992821250588,
        2.127746772690201,
        1.9276933094989992,
        2.072568649376595,
        1.855702919045423,
        2.2857755924534753,
        2.0437598538361414,
        2.442831165071946,
        2.0961577518801233,
        1.6865589911608654,
        1.9819945705075066,
        1.9064476207359675,
        2.5736758764000625,
        1.8583796108470914,
        2.110751806792417,
        2.395426732993467,
        1.790147859150865,
        2.2432814357220856,
        1.7510916857948549,
        1.8497199667370143,
        1.851426073062936,
        2.286250238150213,
        1.775164691430885,
        2.0939399581014575,
        1.7589971167779688,
        1.8497109166023673,
        2.609628451076946,
        2.2000583088884205
      ],
      "mass_2_source": [
        1.5180507998685044,
        1.3438293968987274,
        1.187713828394221,
        1.5940213433899038,
        1.1026430918332997,
        1.2900139542225606,
        1.2918257141445542,
        1.165099396170496,
        1.3277496224952985,
        1.0773822597873806,
        1.4237405971409591,
        1.2369076585393242,
        1.287238132388502,
        1.4913250585448097,
        1.5653344772724134,
        1.2434871317682483,
        1.6589659499713123,
        1.4437866192666746,
        1.4565122189733064,
        1.3864979524825225,
        1.3229859662153833,
        1.2080903648300192,
        1.5301244063223134,
        1.3165387977819452,
        1.4798872192407346,
        1.4342109448750089,
        1.1379125458287607,
        1.5096204043480537,
        1.1267151344281419,
        1.1727385282620435,
        1.1814140344211865,
        1.4717158908073595,
        1.2968650575700842,
        1.5131955394237142,
        1.184143292479116,
        1.1418444416568643,
        1.1557331495106087,
        1.279052470598054,
        1.255169485609017,
        1.5839258253488,
        1.25092054270585,
        1.3624496362093228,
        1.3831566176548598,
        1.1413216487272495,
        1.1668445414433,
        1.4052647626434382,
        1.4219521020282322,
        1.4529156235873109,
        1.197656469453127,
        1.1428341212131288,
        1.2241244299890446,
        1.2144502966754394,
        1.424013432145696,
        1.4843559944695963,
        1.3224556973523205,
        1.2659942595001066,
        1.3682025370503865,
        1.2678940944766792,
        1.1288245644622614,
        1.1089078903831058,
        1.4201231994793488,
        1.6572886623814838,
        1.6591151237158812,
        1.2924226341908616,
        1.5092521839170905,
        1.5997429103784022,
        1.182141072887748,
        1.1778921245965026,
        1.6154801803713257,
        1.5586971435372035,
        1.149386493779427,
        1.4049782495981087,
        1.580761190888094,
        1.1021548691197387,
        1.2578939044906199,
        1.2952506631309892,
        1.406435444657887,
        1.1352141757927787,
        1.472185585027961,
        1.2525835773087108,
        1.2979536525902515,
        1.5832206559175268,
        1.4849557520515522,
        1.190333758796658,
        1.1643755172417745,
        1.3631891104531018,
        1.4055522780481555,
        1.497129420204337,
        1.1439341488980856,
        1.432068594103898,
        1.601633979477267,
        1.6512040055435186,
        1.2196272630091054,
        1.4468442864218605,
        1.4976976259624224,
        1.1767511808662452,
        1.6420834178051076,
        1.2514337348577644,
        1.244683266592174,
        1.5174125521861648,
        1.2952137798241432,
        1.3110181268427017,
        1.467035021252588,
        1.367115108533662,
        1.5728930766174383,
        1.1109748932743901,
        1.1730594740394977,
        1.3025192945166588,
        1.4821002470010827,
        1.1635192414492839,
        1.1281353617165581,
        1.502134091128314,
        1.396333920028058,
        1.1541988901348497,
        1.5417109761060255,
        1.2149908220388659,
        1.2009597068722926,
        1.190466940090812,
        1.5473455478826357,
        1.1825439548677532,
        1.337105016978643,
        1.3933090937432624,
        1.5676406326910406,
        1.6069915163469835,
        1.2382757867015244,
        1.4329758327362474,
        1.140928893500929,
        1.4986893044944047,
        1.2857860947267308,
        1.2368430957522953,
        1.3090129810038866,
        1.2752194102073913,
        1.1809403681078763,
        1.1288812383510463,
        1.3021279949209978,
        1.1935065295024092,
        1.3324009015727334,
        1.4875393727510116,
        1.2459719914125862,
        1.1101949552393786,
        1.094896358426485,
        1.0919994358566318,
        1.455324870769242,
        1.0957540954170635,
        1.529042844948202,
        1.3636756951348263,
        1.2376020656171887,
        1.479493401616636,
        1.1719587683236685,
        1.3752202374614384,
        1.628788129067673,
        1.1865713730311254,
        1.142607210302378,
        1.245831609982528,
        1.3006637425715835,
        1.4438882866880909,
        1.4336146404605667,
        1.3924955898024363,
        1.1201696871595939,
        1.5960641158328408,
        1.3060603818617558,
        1.1323002348420992,
        1.1611656298878141,
        1.235619633485976,
        1.3546163487385925,
        1.237647194283575,
        1.1766240169830533,
        1.444637054294937,
        1.4290401977122977,
        1.540824199789559,
        1.501087699071475,
        1.6195548516138092,
        1.1029381280517203,
        1.135622838109667,
        1.4075435559824854,
        1.5022917661974073,
        1.284617595379731,
        1.1650990228162177,
        1.3719960922294663,
        0.9964305248715714,
        1.2347397438667376,
        1.3000610752313835,
        1.1396517271635525,
        1.1081551780494128,
        1.4681119847340829,
        1.6572419923774901,
        1.5921145707370388,
        1.500099010921867,
        1.4096593544607314,
        1.2308560527225918,
        1.4107722887748164,
        1.4268461103095929,
        1.4665700479821564,
        1.1501622542983532,
        1.1356644182724025,
        1.2604713074092466,
        1.6593702743413254,
        1.4881731651098018,
        1.4890223864067,
        1.206975443420652,
        1.3049085605562014,
        1.2977423874678937,
        1.1669699574386432,
        1.519596670626682,
        1.546913435388135,
        1.2157426757118732,
        1.222320121356716,
        1.2041769029339358,
        1.1746602220784907,
        1.1934390734029094,
        1.6470414238732562,
        1.4317412799097022,
        1.4374100508678642,
        1.4350143878113744,
        1.3433077646672145,
        1.469422423744043,
        1.2703908387328766,
        1.6525888477059358,
        1.4118432128436404,
        1.2937049359359134,
        1.1362208356328654,
        1.177032961513047,
        1.1664327157393508,
        1.1468276363221377,
        1.2233232893224388,
        1.18018899405341,
        1.5457957676056509,
        1.500182560896334,
        1.3503730662580673,
        1.4508310155189914,
        1.3052551234868328,
        1.2490419921246854,
        1.5237889715234478,
        1.224287862404811,
        1.6456621464678993,
        1.2674136313592976,
        1.152255671237563,
        1.14299101220272,
        1.44071739546659,
        1.610212979458967,
        1.1543486490699029,
        1.0955134061105432,
        1.264640178299257,
        1.2671401744135953,
        1.2339370025421603,
        1.506867655540185,
        1.111943033366432,
        1.3995441813758815,
        1.1513401472573106,
        1.1581293701031121,
        1.4605127872774883,
        1.5763179820879687,
        1.622031825796091,
        1.6476789871478068,
        1.0770135108830192,
        1.3720896781579286,
        1.4652620073867857,
        1.302990379520114,
        1.4663138195719623,
        1.434134382047864,
        1.4913606139918978,
        1.2256718042922063,
        1.5106993314785617,
        1.3644414360596469,
        1.2727072067654357,
        1.386396715695908,
        1.1896333378982786,
        1.2340735020067328,
        1.6384603972929055,
        1.4606767550082367,
        1.2712315905451625,
        1.530681897389979,
        1.4972375568591814,
        1.125910665279189,
        1.2640234871619371,
        1.4380189662335308,
        1.3321964232632986,
        1.1190430325170737,
        1.1099796876046888,
        1.1276264687505624,
        1.2970197869504945,
        1.2563571500829924,
        1.4999122933775697,
        1.341885586172745,
        1.3843990977029628,
        1.4577867925755454,
        1.4760799394994815,
        1.3564730957017197,
        1.4064632001526722,
        1.4423964466191654,
        1.1915522561221772,
        1.5321936043677011,
        1.4460069878855695,
        1.3200157565975712,
        1.3001924427127949,
        1.0589415404815508,
        1.5295047743317098,
        1.643218020085422,
        1.5174005320527826,
        1.2252874490953354,
        1.3248551573197045,
        1.431149461577328,
        1.4687803256402843,
        1.5091952233462007,
        1.1679406952788405,
        1.1559024774548836,
        1.452096477728112,
        1.170519683866037,
        1.1836705239381151,
        1.3300175213896195,
        1.3084497914769262,
        1.4978225086777008,
        1.1109681594202145,
        1.2720180364506775,
        1.5429082622819856,
        1.2853643929295775,
        1.351251501252092,
        1.5457817293392484,
        1.2488948247051324,
        1.3012998648277494,
        1.3442467268234701,
        1.3169047969961534,
        1.0942005746207015,
        1.1034274209567598,
        1.2478003385580718,
        1.4692078657281888,
        1.5414245967398301,
        1.2194296013629882,
        1.240130398325322,
        1.1632775163623688,
        1.5371228860275643,
        1.1968207434175677,
        1.3802465330492002,
        1.5836556864329117,
        1.2568188112268792,
        1.2114668625813987,
        1.469558101935716,
        1.2333189415563164,
        1.5363763357205615,
        1.2004165980101025,
        1.4283646844906026,
        1.1912143439297527,
        1.5041190641831232,
        1.3663829070703117,
        1.5577358774931032,
        1.4320111178255508,
        1.4761998443169806,
        1.186309006334063,
        1.4261113370599339,
        1.2498808446134302,
        1.2737821578143051,
        1.2295971791967992,
        1.4591636060467683,
        1.2935755433229255,
        1.6462296648959545,
        1.5303467144720406,
        1.2339979264681578,
        1.1248434551847437,
        1.454349703882073,
        1.3269152622339375,
        1.0879116599176275,
        1.5393990684306404,
        1.44101236426553,
        1.3842807982764107,
        1.5919622607689692,
        1.5334222813663716,
        1.4121563755243585,
        1.537633489649882,
        1.474718771237902,
        1.2595739382532292,
        1.5482467368101998,
        1.1245326928800512,
        1.1623280423891493,
        1.446436394130635,
        1.6298291801300369,
        1.1050219499300644,
        1.2095943687174076,
        1.447656685742156,
        1.3229254257510004,
        1.4181292724884347,
        1.5500101171110383,
        1.5488972733145456,
        1.2217445102206708,
        1.505822018855495,
        1.1460056566793475,
        1.4954509105438287,
        1.29342525092104,
        1.1520880574339167,
        1.6436168875717672,
        1.1879442398578328,
        1.249314091359446,
        1.1142511823061345,
        1.1427317431068387,
        1.4405471478000231,
        1.1071984343408765,
        1.1585431946783495,
        1.4424231024899845,
        1.1524403916121082,
        1.2073725160887474,
        1.6138142019963753,
        1.580195494346514,
        1.4804291435967423,
        1.3257197627854358,
        1.4447210169302358,
        1.4669738159945798,
        1.405361755325677,
        1.630701702699137,
        1.012051067100598,
        1.2122203919096195,
        1.3961480829982222,
        1.544556741055927,
        1.453329639760778,
        1.4062790303858752,
        1.377156365471683,
        1.5550388376165183,
        1.1268375990571315,
        1.061837843271921,
        1.1857002979460103,
        1.2195591046125682,
        1.4804605427986257,
        1.4238807076956532,
        1.2977713456674649,
        1.3712855107142319,
        1.5965057803190579,
        1.3999304794596712,
        1.4231715066954378,
        1.439365833706583,
        1.5650559485149194,
        1.4883725487964405,
        1.137545562368519,
        1.2530502016069058,
        1.2904974923101458,
        1.4703227463372444,
        1.6280829797101362,
        1.0747169498019111,
        1.5245181705592212,
        1.1241592346953257,
        1.146726876725196,
        1.122612093973653,
        1.2324292576622842,
        1.2128328354286164,
        1.1780445268972284,
        1.289346909927563,
        1.2220804660789506,
        1.2940152720696678,
        1.554255864558509,
        1.5434958875343883,
        1.6072803283075887,
        1.3205934950994112,
        1.1098173368562283,
        1.0698037799185343,
        1.31451556729369,
        1.4358774526400533,
        1.1630286086058466,
        1.2207869971856316,
        1.208695928845256,
        1.3672765338596617,
        1.346684421682192,
        1.1207570208765056,
        1.4637465851435538,
        1.4269503285252485,
        1.3480260479743853,
        1.1191973822620882,
        1.294820878910635,
        1.105247321606516,
        1.140629205247015,
        1.491560929653768,
        1.4330569123027135,
        1.1449752116044773,
        1.219878570069209,
        1.1056181075142555,
        1.4967180713709556,
        1.344572113582921,
        1.3065344137008987,
        1.4549512806139568,
        1.3300169473597365,
        1.477783591974091,
        1.2441191237836553,
        1.324162483565113,
        1.1669597942135101,
        1.3087746520171524,
        1.6390728801606667,
        1.4202053039007934,
        1.4547646926616793,
        1.1118778967057108,
        1.463263802300133,
        1.3083817156040978,
        1.2015418088334122,
        1.538467458032347,
        1.2304845193732683,
        1.5483320231916256,
        1.487407133079841,
        1.4741447888917125,
        1.1943914805741251,
        1.5484655777291387,
        1.3103713956198295,
        1.5236172263664578,
        1.4418848407358653,
        1.114515565809113,
        1.2513754784348785
      ],
      "lambda_1": [
        2396.015099887991,
        52.78277398473009,
        107.89103264476456,
        2986.2496698693353,
        381.0803918200259,
        732.741890875971,
        152.2084480465363,
        472.389636812952,
        542.7728813157487,
        73.59977180973125,
        2072.752605049437,
        444.0280550519514,
        1533.549210291625,
        554.8830365817059,
        219.7116728260396,
        129.950363336159,
        249.57071800471454,
        314.8616151518966,
        1198.3305942288764,
        495.18308928154204,
        215.75502515033324,
        348.27100521463325,
        682.3190800040809,
        276.9493543816178,
        1559.4676992735565,
        100.21942074490093,
        69.09144914571111,
        1190.6636753389716,
        335.0770284489363,
        64.83743192458664,
        558.6741782680582,
        230.3486122932632,
        78.81071710444981,
        112.14648690929764,
        67.5274650060798,
        30.81410718366723,
        69.8344449017279,
        80.38771284780104,
        157.663227408553,
        51.82294245013534,
        3475.0241477882287,
        18.258534238135503,
        594.4345848844388,
        684.4532470253331,
        592.3366431540035,
        899.3533552990748,
        201.46360708172577,
        152.88881602471523,
        108.10459658269961,
        757.5651631434076,
        845.406538801967,
        110.66631900849734,
        328.8602007729375,
        2698.1594525739506,
        216.76914714864446,
        856.8052039150001,
        867.2194535358311,
        523.9972408113678,
        1785.827312626188,
        439.3662828050125,
        1233.9100165026948,
        159.59410592825137,
        1113.0822516356575,
        1174.461123705873,
        627.1499884343327,
        488.7358909677765,
        123.32034477501811,
        50.13423483614296,
        465.9599962408844,
        1655.6944411482457,
        361.1223647475537,
        833.3195890774181,
        874.1670837440661,
        78.00685200144986,
        326.45300036602475,
        1135.0415366530583,
        643.5785004393549,
        681.0000052253347,
        728.0406124823811,
        113.01017066093502,
        282.8598585511022,
        1874.6166716465152,
        1199.5074637362018,
        236.78117955453416,
        1210.5880370023046,
        438.27127155296864,
        492.14550188167505,
        97.62518920832319,
        438.90828065111117,
        488.0720957678645,
        2145.489353104508,
        545.8826767804813,
        251.28772351805617,
        2114.590949506376,
        272.9588810289278,
        185.93045543602904,
        2718.2819136226085,
        226.39002383019044,
        320.09952185967757,
        1078.7283633897523,
        113.31637696395266,
        888.7873077227524,
        3330.613224720581,
        367.45120616247874,
        227.9205930843702,
        747.7167952580946,
        25.13444638633111,
        269.021348382319,
        3106.820264405353,
        483.7190829468344,
        104.26569351048839,
        171.61291061228093,
        391.0065342884744,
        251.07936862526753,
        96.73129582175979,
        124.85296151121754,
        153.32745301864594,
        469.4459340366709,
        1224.138190096487,
        102.19985948675907,
        1393.5599566835729,
        1811.532626757859,
        110.66172197189184,
        403.26775206244145,
        60.83903602925499,
        343.56118663299657,
        317.28205435019726,
        262.14266619459164,
        589.0939669474797,
        27.54880052448206,
        756.4874720472346,
        178.0171708928948,
        435.1205399170157,
        5.2140214641183995,
        332.4839008263875,
        1.284753919545186,
        982.3836357500642,
        1808.2115511508234,
        34.02428273191258,
        14.81236480094651,
        391.5994026513538,
        597.5346784968403,
        2379.771911935803,
        164.06334515781364,
        1568.8866606032598,
        412.5256421543796,
        17.434944796968175,
        595.3363857442077,
        1.4080178983248388,
        773.1966708750406,
        480.4964787874349,
        10.21249723551053,
        616.4767559031595,
        37.2387774720068,
        935.9240984590991,
        1163.9908344326416,
        510.307609647926,
        414.29323927391584,
        494.4825409413136,
        1271.889559826901,
        54.146343286995226,
        239.76026194636339,
        1750.3235592154042,
        500.39902874831415,
        1895.9519263399213,
        833.5587480276427,
        8.560775572685131,
        239.74250291980928,
        3309.436386478828,
        2588.5432982395123,
        1188.4727667123334,
        1905.8197414865922,
        688.2476580883896,
        445.9597214366016,
        215.36219755990683,
        24.30985683802251,
        963.4392547490352,
        856.8347866928125,
        34.07203740739907,
        141.91052824622753,
        1484.6179492915496,
        1420.566412032462,
        251.77056603361237,
        753.3500788928164,
        32.655951793572534,
        581.9964186050717,
        249.19440454449625,
        64.02584605563632,
        53.84749720197595,
        256.83300146502353,
        701.2080104180786,
        98.0832912616829,
        980.5813098637423,
        941.3573365545193,
        478.51779840453906,
        96.8998220151705,
        1728.5520625845938,
        472.51833333711255,
        2795.202537272212,
        569.3529174943236,
        1192.0212808613776,
        1535.0228841753592,
        470.7136811307218,
        1287.3754565786176,
        694.6733346879297,
        162.82297581087354,
        649.8881820564878,
        692.1840983297112,
        74.93271606863037,
        185.39372906961304,
        635.5556051208913,
        614.7392633345953,
        42.985933816041474,
        394.3004895340224,
        2173.1540341941095,
        247.53576866679924,
        355.9412669491436,
        3546.0653560715323,
        1799.8603171344457,
        1016.7669061972861,
        552.9994106734855,
        56.84094251329021,
        74.3736983581564,
        382.66800271584765,
        413.2329324004988,
        112.02459301715925,
        4398.926749952608,
        294.30607090203637,
        232.17539257762598,
        2593.1158840115363,
        66.1146375019643,
        162.7409840476572,
        244.3455581445889,
        125.87656304821482,
        277.33982165553334,
        82.80524783183361,
        762.3207427443499,
        203.9550670621784,
        1181.3705137954275,
        1604.5779593890766,
        250.52037419068247,
        352.1060785789697,
        880.8869414040548,
        142.17127968781986,
        222.79695564020045,
        759.4831384519827,
        350.5994539586628,
        821.4649373683093,
        147.66273534400938,
        900.4260316731046,
        704.7285359795054,
        115.64853628484276,
        839.1440013796575,
        108.49852496311946,
        398.42622293418736,
        251.90024408984485,
        1076.4541830017301,
        690.0539427579106,
        1686.3985291078477,
        904.4546794989262,
        328.99940377760987,
        776.9249974275124,
        88.8657256163111,
        1382.2684369013125,
        334.5911799018827,
        429.15494726301483,
        238.60568416611528,
        404.70122353423983,
        291.0160713830292,
        904.0362932888727,
        93.58272770566867,
        3026.9694061584973,
        51.15816209552167,
        93.53117195618387,
        419.6629456921129,
        542.088477399821,
        997.1909519513778,
        127.70377282330148,
        487.50440347690767,
        500.79090730028764,
        29.356200545475932,
        2334.3266669493796,
        2893.348308354605,
        830.1795425275172,
        81.7281045175783,
        637.627147116216,
        1679.9827588080211,
        2407.246147112997,
        1923.6140497749784,
        1673.6218877835488,
        398.98107364866314,
        554.4684923334167,
        3757.4165636522825,
        4020.990200070944,
        1011.0037446062768,
        64.94261075723489,
        1703.768321487745,
        322.83552384250976,
        792.7670742094517,
        3980.8933823072484,
        570.3375792584309,
        334.22702532804266,
        637.1628834124461,
        4380.500326883926,
        346.6333185632114,
        302.02868932729075,
        97.54179473962425,
        294.7810795779693,
        143.43733871615967,
        84.68943741759794,
        638.6607288694819,
        296.09290517489575,
        34.26012773769946,
        2050.73763091742,
        429.97823684195953,
        48.83261105878563,
        407.7999703337881,
        1447.0095676773508,
        6.822489720260859,
        1015.3913654874999,
        66.36127142752046,
        232.02713611247356,
        89.7871413103352,
        1421.2976755006991,
        309.74310225847,
        1031.800514169727,
        433.3246554809844,
        288.3722973770221,
        226.5396905498149,
        707.6219659137498,
        375.3759104510076,
        30.933765818086275,
        826.7116969062689,
        2704.8079337979734,
        1252.5559069244268,
        82.01620760410603,
        1453.8854359810505,
        2332.6963216451218,
        218.76836159721222,
        29.838413139240163,
        383.43579116142286,
        222.16963300206027,
        1891.5877130220347,
        744.9147786829068,
        226.69006842857647,
        44.82497702352437,
        1457.8481246617428,
        33.202191517050295,
        3163.0929642471106,
        217.3249543384728,
        663.0479759647277,
        756.5035449814588,
        475.7169187952655,
        687.7325802830071,
        1769.5440024050038,
        1210.8870734160191,
        471.11785243096807,
        236.5222814418783,
        1675.7152861961383,
        1063.879488975597,
        782.0549657896553,
        664.918647518814,
        1194.4910986172483,
        5.066636826927608,
        1192.4209815190995,
        96.70085402786499,
        32.019160232552274,
        1326.6205175398766,
        1168.9226076066948,
        306.5269581240931,
        172.9765118839544,
        60.249737932997554,
        431.5450107286873,
        388.2731931740105,
        45.80130368965387,
        139.28212763349407,
        142.927077794382,
        689.640641965851,
        867.8286557107131,
        102.31130304046394,
        1473.3464399439122,
        263.31188792303897,
        718.1897604524058,
        246.0200845250931,
        162.64495536042048,
        1731.8197272439475,
        611.291018500321,
        31.538833409342487,
        27.481698606906022,
        33.819769045388966,
        78.34960960257963,
        705.1024187608917,
        256.00393774166224,
        286.4593145467864,
        733.4165277532791,
        98.17604613528034,
        189.21391334954626,
        187.00035633475002,
        539.3853992989206,
        1402.39949074856,
        2244.0189286786353,
        2368.5059180394237,
        1072.7648998779919,
        102.60383643272189,
        466.65537359186015,
        411.920577857509,
        295.3532536233018,
        437.1578562038142,
        85.50642876362103,
        553.1875596083934,
        447.5158040655325,
        97.63096054932616,
        1005.0856890897714,
        80.92099503587845,
        499.6977874352163,
        623.7257074173797,
        60.75910920843123,
        1290.5044813238267,
        56.927862650648315,
        1159.720393484646,
        539.221483774474,
        179.94023810285313,
        532.4386369413886,
        2180.5126386962515,
        1825.1550002522426,
        517.7132657355247,
        2824.7493524555975,
        1862.6965818210647,
        1702.2640548128456,
        262.24995083163753,
        69.7322228367553,
        178.73979086529005,
        430.8097167037405,
        1802.1136978976372,
        199.30560886996952,
        438.22510135845283,
        359.3378258783037,
        24.807305005355687,
        650.1202009246031,
        70.56207757026073,
        374.70012990472435,
        699.1772433780432,
        241.3979700503925,
        818.0345666066443,
        330.3422545686191,
        1025.102716645943,
        621.1287118087229,
        541.8779238952782,
        607.1077380213502,
        325.1704704544726,
        246.94775885735956,
        370.09416864448167,
        635.9746727948009,
        136.05718456873268,
        208.96374359383407,
        238.26098365449113,
        441.5159466052303,
        780.1037717467422,
        302.8824550921033,
        1142.5023378310964,
        159.53375017967258,
        929.1316885006595,
        1095.5578750127804,
        315.7802360836882,
        119.88138758989936,
        2628.790104086133,
        3067.6501020513124,
        183.22549482566447,
        316.45574075957506,
        108.57653348814634,
        172.72307034139382,
        60.04156683878963,
        786.6084898718108,
        611.9807725505311,
        991.5701870218576,
        2084.7922675244836,
        391.2347839189069,
        783.2117070350176,
        807.8967559711853,
        297.70952276495507,
        648.817801691142,
        2482.1421970737483,
        2536.675664702532,
        433.65193478266536,
        435.3593285258521,
        877.9701157219978,
        2746.94766455108,
        126.97068581190094,
        341.5952056828879,
        1035.9730623721618,
        1360.166193057639,
        608.3552223102002,
        1406.0935325266623,
        82.53091785488114,
        266.10191723420303,
        436.5642048595591,
        2012.327354622895,
        574.7538632319861,
        151.09086621929941,
        1095.5933704975337
      ],
      "lambda_2": [
        264.6023126705439,
        4614.5090802764735,
        850.8305068893138,
        709.7188066013185,
        8556.552066712671,
        6034.423807090682,
        1590.754238478947,
        3320.527686305352,
        3316.8970417329683,
        2164.37990240841,
        2050.0367844660054,
        3457.771832196405,
        346.29544788227946,
        454.3874685479645,
        310.01900757014323,
        3005.9453698603324,
        566.8858944606427,
        2710.129798724531,
        3120.5927465097843,
        1604.2244904455747,
        533.6175220539703,
        5093.575160915217,
        182.70827655750944,
        3825.741913887778,
        843.9289244053223,
        5781.862327372685,
        2292.0088714893423,
        307.9321398985678,
        8817.760899893048,
        7033.769711158497,
        7594.128856911086,
        1104.2567850810647,
        6805.690696634473,
        2590.730145883982,
        4533.333522232923,
        5241.723461277963,
        1684.1995304392372,
        6664.372815261329,
        100.99961146460078,
        3075.4845005129605,
        609.2797003187216,
        257.5157993062465,
        3455.9370335878507,
        5581.166431505895,
        2434.4816785166513,
        6915.553576505483,
        6760.50290504345,
        4305.695616339374,
        4143.919706309181,
        3404.4365480347756,
        4379.590074834148,
        456.66999745576317,
        1583.6519926943827,
        606.6246920423604,
        1103.2561822678665,
        4726.88385579539,
        2989.830996330843,
        3919.873541221968,
        6448.276966631493,
        6122.888393283985,
        1645.8805331599472,
        547.4037381825964,
        198.8188502968595,
        1265.1533437957532,
        457.656577201382,
        830.7990896105023,
        213.07259734671882,
        2098.4218367441795,
        34.07002707070954,
        51.8050004091017,
        2527.994286384862,
        3915.237214257386,
        2781.7055502535463,
        8290.254616741488,
        4710.608555345715,
        3426.0778395813386,
        3709.0159759439352,
        3837.2870839985785,
        438.5676935701463,
        513.62747449472,
        4462.492211552127,
        33.06308127497463,
        91.95193907869019,
        1287.2503832027044,
        1678.305547072175,
        3171.4907140865566,
        1220.90857532917,
        1717.8908356432053,
        4209.478849311584,
        986.9557220776978,
        1083.0281709395472,
        652.0595505386891,
        4148.287636284532,
        408.88714154622375,
        1157.8345188836824,
        4441.517272923196,
        113.80320283531158,
        6548.862852976858,
        976.6640676934823,
        2385.23821915324,
        10.464293284132252,
        3132.01832114386,
        783.8057885601365,
        6900.726983040398,
        1311.596436144526,
        3973.4468593862325,
        3037.189944332888,
        2258.8181728047875,
        1528.7310031047193,
        50.01405366830333,
        6577.770740955727,
        2360.7443109675314,
        3487.5823523598915,
        9283.459788177783,
        1251.2855289103256,
        703.1646345258623,
        5659.460459774361,
        8697.444516034975,
        964.3001344532613,
        5699.086563738394,
        5155.840366979438,
        87.55665652480616,
        325.9270619731893,
        531.5076977737868,
        27.902273734068277,
        2391.473378804948,
        7435.972279769295,
        4803.221140164983,
        3647.9388080840818,
        1492.8588197347694,
        2374.2158025796875,
        2916.6396735647104,
        5149.4246771032185,
        5822.1788590060105,
        4753.781887342072,
        188.47089483209115,
        594.9142703982995,
        2562.2023607968,
        600.5794042312161,
        7984.173100468605,
        6249.492721929755,
        8023.93733330995,
        678.655565582287,
        8559.838627682635,
        772.7316405623892,
        842.2982574994826,
        1128.6098615939204,
        810.269781856678,
        92.5014676342914,
        1517.2325575600912,
        69.35523629674428,
        546.3619356940012,
        5274.125791439703,
        1226.8650765725392,
        5413.016432642531,
        3387.9879534434635,
        3201.601827014568,
        2568.015888157313,
        8326.761867298035,
        1117.5063138084065,
        1921.9412465230585,
        6726.812079309809,
        6590.476933221074,
        3672.090611551482,
        296.95927324003617,
        5337.889304318179,
        198.481630660515,
        3956.3134735113913,
        943.6071375911719,
        4113.100367235832,
        2333.964851530782,
        2889.4717209223545,
        2537.022455337122,
        6484.880421790763,
        1257.82851970851,
        461.1157801149489,
        3736.2391994150853,
        1691.983081431403,
        1104.0202655963078,
        4354.470182114525,
        874.8337644370007,
        2266.938193720503,
        5575.977635277901,
        8256.80619063669,
        3937.0720212928723,
        840.171375380974,
        599.2145814367354,
        1486.9598273953213,
        1448.0340775663178,
        2186.670372987135,
        2513.323253153868,
        2011.9202613991758,
        3732.0160926382514,
        2004.5319741580186,
        3947.826810096565,
        156.85889070309113,
        406.86590798207067,
        811.4736635964379,
        633.9925935834661,
        2423.1878109893887,
        2141.238088196061,
        1427.3193838417255,
        7870.648703422736,
        1920.5704655552183,
        475.6856480165889,
        6313.084984291634,
        3806.5878538623824,
        3752.886243102227,
        4710.010261016571,
        825.812394182019,
        326.3731669986457,
        2154.8264470745494,
        4975.412014337018,
        4340.079751310392,
        928.9740832982235,
        2108.422386829455,
        2887.741312342562,
        4103.723487164127,
        5629.403627887525,
        2357.382187649237,
        4910.506635613049,
        3064.044997921396,
        6719.456197469867,
        3037.4973452592494,
        3505.2762026799905,
        5506.531598797005,
        7792.889764395065,
        507.29205539439414,
        394.0713454638777,
        1314.975105564964,
        764.1076630692957,
        3627.1241367436064,
        632.5315223607432,
        1455.847396982671,
        434.00769054728187,
        1827.573673307967,
        1297.142737096588,
        503.92720205799424,
        2505.998322084345,
        4371.487959629155,
        2701.2843740812104,
        2419.7250411231157,
        3101.8988084505404,
        1914.7775520059993,
        5304.380315259014,
        624.5663537862791,
        4734.410612726392,
        2415.316139295443,
        2796.7066927821006,
        7501.239258349502,
        1724.0787862258871,
        680.467438657284,
        2065.9965041717664,
        736.905567507042,
        5745.533297274321,
        1169.6845871508083,
        1725.7028770688435,
        1461.2809999660012,
        1912.2612780866496,
        2530.453594991485,
        1719.9048411917984,
        4048.987906841243,
        683.3089571900416,
        742.1112476251221,
        4046.7524933363316,
        394.3869725604703,
        7588.088765076044,
        3115.1204576460273,
        634.2268875987415,
        2119.9542844813486,
        3898.300808520623,
        679.4776173261039,
        841.8348935529989,
        1629.0981240287956,
        3605.4498379523116,
        451.60239174841416,
        3862.3008517950007,
        5443.454568635257,
        4593.262439864019,
        4037.555942983792,
        699.2462066423509,
        7352.385051152226,
        1075.4956118460434,
        1856.8716369633676,
        3477.397326074559,
        2641.318619343678,
        791.481845458213,
        3797.1708267537333,
        947.7567431115659,
        4009.7893358691067,
        7975.044170215893,
        2863.772008003902,
        6303.548361684147,
        2804.601465804479,
        8167.812050244742,
        5719.377581813031,
        499.67655279726705,
        441.73342354618006,
        1019.9158247910593,
        5580.399661270793,
        1750.802112437373,
        1475.5074495660215,
        321.7493452610902,
        3878.327017461781,
        2636.686154813425,
        4482.705713679595,
        1578.358451120761,
        3183.2090236910326,
        764.5251255079307,
        5994.258317535515,
        4682.786410912454,
        894.2197207121208,
        5221.899814006312,
        342.44765311159756,
        765.2868582778896,
        4652.316127210633,
        330.9747701974673,
        1493.2793494749642,
        318.56590994469974,
        5653.752762567694,
        3651.032749445541,
        2249.1602343021823,
        1336.9490748144738,
        6555.733951352376,
        6310.214485605531,
        2877.222145638965,
        1318.1885673275178,
        3799.882846537105,
        48.73067304446963,
        3769.146556499567,
        1710.7231193992423,
        239.22518591419296,
        3757.893254152689,
        736.1037458668476,
        2196.6084590301925,
        406.73193089589904,
        524.9011645881632,
        899.3938018479095,
        749.7065869313137,
        1553.894163835316,
        289.4955569000567,
        1904.8509008538647,
        181.755477623479,
        6337.088241363589,
        189.57223394980912,
        647.4852974373797,
        320.78428147663755,
        834.6202155276338,
        1505.675487293118,
        1181.2851298559315,
        1792.855142758638,
        1505.549634824171,
        3421.8081748816253,
        5218.759394911255,
        1770.1825250466097,
        1580.5437754349432,
        3134.3766864010076,
        6167.513472651223,
        2503.7300902993566,
        3596.1989798071813,
        6964.683695290577,
        38.755271854003716,
        4293.3239888983735,
        4428.2880263689285,
        1017.3334480691212,
        877.3666458313962,
        4552.410226200454,
        1516.7642774713224,
        595.8626345582753,
        1108.6125747811968,
        1064.0992776472947,
        7446.42381153355,
        8719.448057039108,
        5008.651991029005,
        3291.6076561035397,
        1835.4210670692287,
        1442.5423254178431,
        5065.221909499585,
        926.9716452905346,
        2369.333698851287,
        1107.238711862047,
        112.70620101973186,
        3315.6568550689276,
        1089.1557143064156,
        7974.565346197539,
        1670.442971099625,
        1100.9597969127187,
        2601.0373139348535,
        3980.404505736486,
        3411.005553189153,
        5822.388035237258,
        6489.501004623028,
        3135.7353596865787,
        2063.2914971524583,
        1563.7265149876057,
        697.2034144076421,
        6888.091348454256,
        7669.94600561001,
        7432.877003230256,
        1028.738168343649,
        123.700151339127,
        883.0706780285444,
        3084.819166248304,
        363.414895559837,
        27.52446353650398,
        5573.813001063034,
        750.5072401872729,
        7034.677783771811,
        7775.430317665808,
        3747.027290168444,
        373.12742391873036,
        5918.5529562472,
        1767.9188381060185,
        1148.254518189528,
        1309.118672167684,
        5429.057187090452,
        972.2824520213106,
        5603.201610374929,
        1632.704391366226,
        3632.388309298959,
        2154.838939923814,
        3608.570595879602,
        3661.515624188032,
        1365.7584351025698,
        5849.018503160667,
        268.4990346804016,
        3276.0847541467524,
        241.28607403806382,
        190.28526397127106,
        2627.524738234284,
        5883.314585428399,
        150.4358941992974,
        2764.262270008078,
        1421.0505938136096,
        2643.44999582842,
        1397.6450017200639,
        4193.239703122227,
        9670.45209912599,
        3072.068494325193,
        6387.696412778811,
        3048.389381025091,
        1622.032344586237,
        3465.4520951943878,
        3999.1409246562703,
        2920.9634259907143,
        2468.881974394414,
        276.7829329325871,
        198.92767340625005,
        234.67894805893823,
        9245.081798609222,
        4463.853248037371,
        1002.8207650103044,
        2438.6564520416387,
        6012.655608530397,
        518.8030855728476,
        778.8530686887068,
        375.55759785676065,
        2781.221836329493,
        3972.794152461031,
        3463.107592867481,
        1822.375942128305,
        2697.3172827831504,
        3060.63369869224,
        894.9564806000739,
        8278.23785846337,
        2442.668372374597,
        3098.243205373208,
        8811.487750459191,
        5625.272168177571,
        6541.757646519672,
        5089.984816956508,
        7561.913341977379,
        2815.644464852696,
        4774.545104790391,
        2485.94476832189,
        3773.7053436817796,
        171.65996545333778,
        2157.019798793821,
        5565.410675030933,
        3059.3187598907016,
        3509.1959738667133,
        255.0555836721103,
        6435.321878373462,
        2085.3689055525,
        4232.09362151928,
        3184.7888951782566,
        510.48936916834964,
        239.46509880057152,
        1582.0358713919286,
        3753.435981899622,
        1070.4877106786016,
        1076.1504925072952,
        985.9295565225011,
        2575.5876176036613,
        1841.7372283296688,
        800.5769213712078,
        460.2324441737201,
        2569.2437495230615,
        7861.32116011861,
        3093.3753303267877
      ],
      "luminosity_distance": [
        186.815569080695,
        92.76963467254767,
        159.15964275312854,
        222.36898142582118,
        145.3510422195376,
        158.5456241530676,
        172.33202134061733,
        192.9437899145772,
        113.87455953179258,
        159.14568049416383,
        198.85117188791068,
        207.60977799249815,
        115.22124562811389,
        146.23802919112032,
        94.86617165327759,
        75.37171454210956,
        111.83132653013433,
        190.68704461418554,
        136.40269661544545,
        147.47411513208547,
        122.80185863226151,
        158.5002108095483,
        189.2075207015331,
        71.58789296696158,
        196.3763135293229,
        148.66957539824236,
        112.59091553692436,
        180.8139090949937,
        146.22005752546676,
        95.13605277177928,
        92.81822889729504,
        108.3972322804044,
        104.9450242220814,
        162.4767373449989,
        233.59012437299498,
        96.20545068089507,
        115.84592713962871,
        142.87623453641444,
        153.82616704137382,
        139.6837153740024,
        149.70944089978033,
        191.09905139008774,
        118.92173249836458,
        120.95734543677268,
        101.42395703644553,
        108.37512272185931,
        200.6919408263049,
        180.75016990105652,
        196.69058746108598,
        216.21293698931424,
        222.9982524717255,
        54.49738892638013,
        122.86349075664337,
        147.422830827586,
        105.2876029723773,
        116.89756447415392,
        151.48367515584997,
        234.63605648590823,
        147.71739504514397,
        123.19617696818469,
        140.11786214038165,
        106.82966055071964,
        73.7994182923496,
        71.09812236894062,
        167.69241794595163,
        149.3080282458502,
        84.75706881852072,
        146.93292848102237,
        109.46349392210121,
        153.15520606564587,
        126.34588808620326,
        116.6267782100459,
        73.6251924363924,
        92.63707295901598,
        187.61692962846993,
        186.24665388117657,
        117.42750095544626,
        176.0038390044348,
        143.77631227669832,
        64.59258356688626,
        143.97430932225512,
        131.8607430994166,
        87.73599089593264,
        169.60596015081643,
        235.38822471516616,
        152.88335699639552,
        180.29887483601874,
        137.32461149673793,
        127.75772241867486,
        163.4673128900557,
        174.75153860310476,
        121.08364222449715,
        110.32016182670496,
        164.18008815145936,
        176.03011486300161,
        260.0054478377318,
        150.14719418907023,
        170.03976426146426,
        157.09340023668557,
        167.14415570798505,
        131.39408397129125,
        153.13841434236005,
        212.26644166426175,
        167.20776010504164,
        111.73271390385953,
        152.55010207696617,
        67.95634075447607,
        70.63884453806078,
        148.70009927935698,
        174.88482580091156,
        136.6401754628061,
        134.46531718607437,
        135.254110747791,
        161.36741526914054,
        105.70978387490449,
        214.32421695704332,
        164.98056144721394,
        112.49535532669093,
        124.81743735184827,
        157.0846911488153,
        164.64227541770907,
        158.52531040952488,
        101.65355067488754,
        102.40034497759717,
        77.2442046358184,
        197.3136500816428,
        122.13945374857231,
        107.77308102061572,
        88.22107711723729,
        67.92693423435368,
        210.2928171398201,
        82.0638654978379,
        161.21792108968404,
        107.57968258164769,
        227.56201402804896,
        76.6379606512876,
        129.84527482843723,
        165.71726900916806,
        102.73145049081427,
        92.60753912278172,
        155.90018806015715,
        184.65839710615862,
        93.5735885887809,
        99.97563176081688,
        178.86486681633332,
        72.34658451083295,
        85.80280156973448,
        171.3604206192371,
        164.4627735635462,
        148.03015420040157,
        182.5384509501953,
        187.70391939343406,
        147.38868466673784,
        63.07711878051485,
        232.22753718331953,
        189.65279077265293,
        112.7433274747257,
        120.17817565113147,
        142.3802288522478,
        96.35765207417946,
        100.87242092228543,
        121.41057853420067,
        119.59437550098512,
        159.85782167364596,
        202.52473473152503,
        180.26513281708648,
        207.4883676160124,
        160.10319774445747,
        129.38059685374398,
        121.88164951852522,
        163.79829725690638,
        247.56230028875507,
        138.43852519766344,
        90.01806716488296,
        66.16279660426284,
        75.47596947110131,
        197.59894944227372,
        145.98536908786448,
        147.63539654832746,
        80.04255972786608,
        200.21212913081925,
        200.12927586854263,
        135.54838642232286,
        169.2316322340779,
        149.44170088475076,
        125.78088725185277,
        75.68467457669955,
        189.7931639310261,
        130.3478877386041,
        207.67516953011926,
        138.52289051962654,
        200.46443402124228,
        160.79705113403162,
        276.90180380218476,
        123.84236938534269,
        134.52640090781807,
        126.6412470591571,
        148.0262227450004,
        227.84896816546544,
        105.20281168215895,
        93.44284439092442,
        100.9679067334464,
        121.12429047518187,
        168.02920305329712,
        141.2846172013544,
        173.62816241508875,
        195.10253548539268,
        221.8792507081292,
        143.4210637343165,
        161.06545314309443,
        102.84587990885994,
        151.08136928163364,
        150.34580095789937,
        160.56247677260362,
        137.12184863792686,
        200.99502425771738,
        85.17994284157818,
        118.11081555347751,
        198.60550091722124,
        208.2353745204182,
        196.0504259986892,
        102.22465397842433,
        141.9506933279947,
        143.99896926999452,
        194.52961490370672,
        201.93545735056088,
        146.56967828217205,
        172.91080262946994,
        90.67133753242192,
        224.54387949837945,
        97.5079266446377,
        185.85583796557955,
        167.37555691674308,
        105.73652153573624,
        91.18846032165065,
        139.43271321859896,
        194.1769085495827,
        106.43446620425108,
        152.93301278884024,
        140.80663117771746,
        134.29760297977478,
        185.8725738213386,
        189.00638761660983,
        209.27657132263943,
        241.86102261939698,
        244.41664087553588,
        190.6283304673586,
        118.31768580609739,
        141.2477815131709,
        204.20689500389648,
        141.10634594798822,
        89.69144423619001,
        186.20579879930781,
        73.40313463803221,
        152.73975087296498,
        120.2798669601398,
        119.31554204965475,
        126.86626987149162,
        138.57486502120807,
        147.38064704444463,
        77.76430359679375,
        197.15830929153114,
        88.62183237226404,
        173.6160035696983,
        164.1242488573017,
        108.72367957013157,
        143.4610027770271,
        121.09764135593727,
        104.12103130580924,
        76.455928642066,
        172.53417754289805,
        105.47201485301538,
        152.9694652536212,
        141.4696329673814,
        193.93596901119946,
        202.42406810798403,
        240.69183537020618,
        191.6237459570366,
        140.6132062521179,
        160.6834459798009,
        92.06198091365175,
        103.49833686827057,
        149.06293686014087,
        198.06443518415344,
        151.9519125277579,
        184.9786162935458,
        114.08976365851814,
        152.64141566370733,
        116.21287092227834,
        184.5157188963562,
        152.3681629918758,
        168.42526184389274,
        218.59740111526025,
        218.5091965048201,
        171.4544066052842,
        123.9728004098545,
        117.98590462136649,
        115.8065401317304,
        160.13739488773686,
        167.59454010837004,
        170.48688779689294,
        133.12100149918882,
        138.7830822495955,
        172.07388556966816,
        124.18784912913478,
        106.04804892228971,
        135.33275279739848,
        125.83344298504288,
        94.51039131824129,
        197.30196251829776,
        212.2770773343352,
        208.06306818747146,
        168.83279291327153,
        156.86367566965563,
        135.67930325296277,
        135.1469391896115,
        110.14107368888108,
        152.93953454327107,
        58.13244346072717,
        170.98337311845995,
        135.77372039123443,
        125.6850997334718,
        148.97555308870307,
        177.18679679892864,
        125.48343615539882,
        153.5601854439845,
        103.26612531649089,
        168.0201145133822,
        167.06725870819815,
        197.44527229492306,
        146.79709997675081,
        54.86532532224719,
        228.77492960151685,
        118.10519038067542,
        147.3443714680987,
        174.42651351762245,
        90.63846807262671,
        200.35925863356263,
        87.2492715100153,
        152.75901967441928,
        115.55635906721608,
        84.41667955612766,
        153.9462784827881,
        111.16298078692675,
        82.60525506735553,
        181.43307621384182,
        145.58864952533588,
        117.70370214126015,
        167.97463484261309,
        158.25519541117177,
        64.30048518745765,
        170.68591960934378,
        107.64005393944902,
        143.70603436958712,
        118.68207747662616,
        147.2221093977799,
        173.02441627294132,
        144.82042775154656,
        154.9759843819098,
        113.33955097541164,
        162.792417630123,
        131.14820116092093,
        183.82952053333753,
        213.23309885540598,
        93.68439247221727,
        137.3759002922281,
        157.077960574728,
        161.8508334862892,
        127.55227332551651,
        180.0175374862528,
        114.52376589412802,
        130.53880861836157,
        126.43092743780204,
        149.52186327200394,
        153.30600701905263,
        178.94441918836597,
        92.7124820289297,
        62.479760944515206,
        132.718031901612,
        140.74521510172545,
        199.71175125315884,
        84.58286772891812,
        251.18433054796645,
        166.08833732427794,
        122.7615910637363,
        43.04865746379838,
        110.61212612208973,
        85.22006079097629,
        143.09290736838346,
        112.64907551220149,
        137.6294570854355,
        86.75583789389815,
        115.05247473631364,
        98.71936503091388,
        180.5051601307484,
        222.02302077932634,
        224.08771741620365,
        190.07792006151737,
        195.21194748648026,
        90.94779213902807,
        204.11548038976883,
        230.83509005240765,
        140.14652109238182,
        90.503430932917,
        84.6286752137871,
        209.18232603997632,
        111.60488531472252,
        151.41535316368112,
        71.41848318341411,
        160.55486724936998,
        133.20642643530087,
        98.14090171877892,
        191.4858747030855,
        172.0207028057628,
        114.12727812821328,
        166.46349436183237,
        98.11396012722328,
        185.2608378098926,
        94.15280991888781,
        156.67652487562327,
        152.42641343855817,
        97.18128207801018,
        142.03741984936553,
        131.69193489188132,
        192.88561413363124,
        98.40635645998232,
        118.8787476571479,
        128.12708835449737,
        193.2373897086273,
        152.00253926965934,
        192.0636756220201,
        140.14139806459275,
        148.19808130721637,
        223.34634405680328,
        149.41852295936351,
        80.94927526184485,
        117.59124733430095,
        106.56607203876445,
        179.22473594984027,
        215.99053847033312,
        107.0888992643234,
        119.06801387823201,
        77.21120294524604,
        178.90869631749914,
        96.17912080334847,
        213.2535311764846,
        119.60099584442065,
        111.26745524457208,
        150.22127809510042,
        115.98932747835092,
        133.9312819866722,
        148.58527955586712,
        184.12509797205237,
        113.86288773882202,
        158.61770105493432,
        134.2960766896327,
        117.63305390714704,
        95.4083893675366,
        132.22717938787903,
        233.15912458505838,
        152.51183068883415,
        163.97963432197128,
        167.15341983397585,
        114.71271415721368,
        116.14816246711003,
        143.97150450185288,
        196.4400666366126,
        115.89054010393214,
        101.82175847318122,
        186.4616059567954,
        128.3104118159982,
        158.40585475376378,
        202.08424985850223,
        141.21969579784076,
        98.85061432872078,
        155.7350250915846,
        148.63261713717964,
        100.74377819334464,
        198.90967189220507,
        115.01605635632332,
        169.63137333152335,
        122.93639142865949,
        98.00530482806036,
        124.64152937455192,
        125.11816895564877,
        169.10998945055974,
        155.03152823935707,
        84.58524445605097,
        135.60263192311996,
        170.57915903691563,
        171.95011895345175,
        141.32610724278254,
        162.6409248193439,
        206.27150694330385,
        139.52992480912167,
        168.75122146176835,
        201.8756385453181,
        218.3470024928323,
        88.79686509673725,
        171.76475672623752
      ]
    }
  },
  "injection_parameters": null,
  "meta_data": {},
  "search_parameter_keys": null,
  "fixed_parameter_keys": null,
  "constraint_parameter_keys": null,
  "sampling_time": null,
  "sampler_kwargs": null,
  "use_ratio": null,
  "information_gain": NaN,
  "log_likelihood_evaluations": null,
  "log_prior_evaluations": null,
  "parameter_labels": [
    "$\\mathcal{M}$",
    "$q$",
    "$a_1$",
    "$a_2$",
    "$\\theta_1$",
    "$\\theta_2$",
    "$\\Delta\\phi$",
    "$\\phi_{JL}$",
    "$\\Lambda_1$",
    "$\\Lambda_2$",
    "$\\theta_{JN}$",
    "$\\psi$",
    "$\\phi$",
    "$t_c$",
    "$\\epsilon$",
    "$\\kappa$",
    "$t_'$",
    "$A^L1_0$",
    "$A^L1_1$",
    "$A^L1_2$",
    "$A^L1_3$",
    "$A^L1_4$",
    "$A^L1_5$",
    "$A^L1_6$",
    "$A^L1_7$",
    "$A^L1_8$",
    "$A^L1_9$",
    "$\\phi^L1_0$",
    "$\\phi^L1_1$",
    "$\\phi^L1_2$",
    "$\\phi^L1_3$",
    "$\\phi^L1_4$",
    "$\\phi^L1_5$",
    "$\\phi^L1_6$",
    "$\\phi^L1_7$",
    "$\\phi^L1_8$",
    "$\\phi^L1_9$",
    "$A^V1_0$",
    "$A^V1_1$",
    "$A^V1_2$",
    "$A^V1_3$",
    "$A^V1_4$",
    "$A^V1_5$",
    "$A^V1_6$",
    "$A^V1_7$",
    "$A^V1_8$",
    "$A^V1_9$",
    "$\\phi^V1_0$",
    "$\\phi^V1_1$",
    "$\\phi^V1_2$",
    "$\\phi^V1_3$",
    "$\\phi^V1_4$",
    "$\\phi^V1_5$",
    "$\\phi^V1_6$",
    "$\\phi^V1_7$",
    "$\\phi^V1_8$",
    "$\\phi^V1_9$"
  ],
  "parameter_labels_with_unit": [
    "$\\mathcal{M}$ [$M_{\\odot}$]",
    "$q$",
    "$a_1$",
    "$a_2$",
    "$\\theta_1$",
    "$\\theta_2$",
    "$\\Delta\\phi$",
    "$\\phi_{JL}$",
    "$\\Lambda_1$",
    "$\\Lambda_2$",
    "$\\theta_{JN}$",
    "$\\psi$",
    "$\\phi$",
    "$t_c$",
    "$\\epsilon$",
    "$\\kappa$",
    "$t_'$ [$s$]",
    "$A^L1_0$",
    "$A^L1_1$",
    "$A^L1_2$",
    "$A^L1_3$",
    "$A^L1_4$",
    "$A^L1_5$",
    "$A^L1_6$",
    "$A^L1_7$",
    "$A^L1_8$",
    "$A^L1_9$",
    "$\\phi^L1_0$",
    "$\\phi^L1_1$",
    "$\\phi^L1_2$",
    "$\\phi^L1_3$",
    "$\\phi^L1_4$",
    "$\\phi^L1_5$",
    "$\\phi^L1_6$",
    "$\\phi^L1_7$",
    "$\\phi^L1_8$",
    "$\\phi^L1_9$",
    "$A^V1_0$",
    "$A^V1_1$",
    "$A^V1_2$",
    "$A^V1_3$",
    "$A^V1_4$",
    "$A^V1_5$",
    "$A^V1_6$",
    "$A^V1_7$",
    "$A^V1_8$",
    "$A^V1_9$",
    "$\\phi^V1_0$",
    "$\\phi^V1_1$",
    "$\\phi^V1_2$",
    "$\\phi^V1_3$",
    "$\\phi^V1_4$",
    "$\\phi^V1_5$",
    "$\\phi^V1_6$",
    "$\\phi^V1_7$",
    "$\\phi^V1_8$",
    "$\\phi^V1_9$"
  ],
  "version": "bilby=1.2.1"
}