EOS,Mmax 
0,2.08944368879 
1,2.37930910087 
2,2.0468387564 
3,2.06235225732 
4,2.29424990188 
5,2.16364933593 
6,2.1206514946 
7,2.07588081952 
8,2.01211369333 
9,2.18057393034 
10,2.11659653794 
11,2.15873675022 
12,2.07420076231 
13,2.02374903054 
14,2.19984816505 
15,2.48480384942 
16,2.13599136325 
17,1.99441088846 
18,2.67244590337 
19,2.17671616856 
20,2.13304280284 
21,2.04123766112 
22,2.02730008551 
23,2.0931899706 
24,1.97771010295 
25,2.11384059215 
26,2.09409924355 
27,2.47058687638 
28,2.19534706692 
29,2.29506402689 
30,2.05485614185 
31,2.03900746244 
32,2.53231576886 
33,2.12065963331 
34,2.41942180871 
35,2.12749907366 
36,2.11413383928 
37,2.19317958753 
38,1.97160949522 
39,2.21266551002 
40,2.12913689723 
41,2.4573731728 
42,2.35285648203 
43,2.03205660172 
44,2.11117321577 
45,2.17320951907 
46,2.27647639699 
47,2.47453778342 
48,2.00265488484 
49,2.367070507 
50,2.08970544843 
51,2.38429505797 
52,2.39969105172 
53,2.02793712959 
54,1.99806124483 
55,2.32257354962 
56,2.30698893674 
57,2.04722755218 
58,1.97207949744 
59,2.01254628622 
60,2.03340080899 
61,1.97992488693 
62,2.19006221926 
63,2.16738133793 
64,2.12607266666 
65,2.25413491258 
66,2.22718228068 
67,2.10582707765 
68,2.38112815227 
69,2.08021921344 
70,1.98430815449 
71,2.44131791048 
72,1.99526227978 
73,2.05335240045 
74,2.57197652538 
75,1.99790426655 
76,2.01984970336 
77,2.08936025282 
78,2.1591141336 
79,2.13811922692 
80,2.12638414729 
81,2.02463862375 
82,1.99960802413 
83,2.14936368424 
84,2.34103920458 
85,2.35620304574 
86,1.99530664988 
87,2.42008670603 
88,2.00849494723 
89,2.12319416298 
90,2.03665466542 
91,2.32799381449 
92,2.15986049572 
93,2.31715568934 
94,2.42665370312 
95,2.01024268477 
96,2.18986663173 
97,2.02669354879 
98,2.18455417663 
99,2.10637027191 
100,2.36413951525 
101,2.08871941994 
102,1.99280498409 
103,2.35709667488 
104,2.04283073328 
105,2.05449348329 
106,1.97044804475 
107,2.01062025826 
108,2.00929268655 
109,2.13105384671 
110,2.50646748445 
111,2.00764941731 
112,2.12259476039 
113,2.162586155 
114,1.99734054223 
115,2.16623566508 
116,2.07536378833 
117,1.98064278114 
118,2.10302283303 
119,2.05746851778 
120,2.38554989491 
121,2.38084397422 
122,2.36250061566 
123,2.2307822381 
124,2.35782969194 
125,2.34745811022 
126,2.09950019869 
127,2.18170507345 
128,2.32476311856 
129,1.982876119 
130,2.42689485917 
131,2.37807493838 
132,2.1659982905 
133,2.03460077026 
134,2.17842404805 
135,2.45469284759 
136,2.02058015187 
137,2.2706181679 
138,2.33321537814 
139,2.21677251984 
140,1.9700891928 
141,2.33322104917 
142,1.97215884339 
143,2.00561241583 
144,2.08598472891 
145,1.97818823558 
146,2.18459103521 
147,2.37422169306 
148,2.33376606922 
149,2.02614710628 
150,2.21582229399 
151,2.15194227711 
152,2.12155037874 
153,2.209948388 
154,2.15384823338 
155,2.28708915555 
156,2.41624186604 
157,2.52071014709 
158,2.17574309952 
159,2.04655449852 
160,2.0215425533 
161,2.04367863235 
162,2.25117558096 
163,2.38012379438 
164,2.61426482711 
165,2.56199941503 
166,2.64053904678 
167,2.39325046643 
168,2.14016680087 
169,2.12478489033 
170,2.01312169029 
171,1.9924733719 
172,2.05916058253 
173,2.06395053918 
174,2.13172022453 
175,2.37041352522 
176,1.99762906765 
177,2.24288924829 
178,2.02497772645 
179,2.50792059964 
180,2.33248685259 
181,2.0532651028 
182,2.0673487329 
183,2.00718399855 
184,2.11095216917 
185,2.17116072709 
186,2.27206102045 
187,2.12681069671 
188,2.43965690209 
189,2.1042668172 
190,2.02533777505 
191,2.10799478096 
192,2.03359755202 
193,2.26020642131 
194,2.0933493062 
195,2.38857556778 
196,2.04092842336 
197,1.99163120387 
198,2.61118766278 
199,2.26994087908 
200,2.08460657417 
201,2.19813158786 
202,2.22203473133 
203,1.99911780582 
204,2.00877082042 
205,2.2543618176 
206,2.20297940628 
207,2.08909406022 
208,2.23099132438 
209,2.02288669718 
210,2.10774467045 
211,2.09088818218 
212,2.0306338541 
213,1.98321225378 
214,2.31993106372 
215,2.22671713681 
216,1.98043957178 
217,2.35258963778 
218,2.37715284847 
219,2.05927223469 
220,2.14074344642 
221,2.00500471233 
222,2.46742196097 
223,2.00381886878 
224,2.53587646303 
225,2.12992759068 
226,2.10398892102 
227,2.55101615609 
228,2.68758710109 
229,2.08636451992 
230,2.47503229149 
231,2.21847129781 
232,2.19015848092 
233,2.27677383951 
234,2.08900430727 
235,2.00829649795 
236,2.16950476455 
237,2.13280542524 
238,2.42402100181 
239,2.17005738757 
240,2.14249892106 
241,2.23466896301 
242,2.38270623579 
243,2.02130236537 
244,2.44922478344 
245,2.1340668528 
246,1.98278122427 
247,2.38133808896 
248,2.08595052089 
249,2.07865782015 
250,2.09090911503 
251,2.22359598918 
252,2.03717028726 
253,1.97573868341 
254,2.00873987041 
255,1.99767754292 
256,2.12521375662 
257,2.04263709538 
258,1.99016134317 
259,2.43111550636 
260,1.98266474971 
261,2.26959231781 
262,2.37601851672 
263,2.38565715554 
264,2.1182628981 
265,1.97760243743 
266,2.04653139555 
267,2.11877593223 
268,2.06501197116 
269,2.15388083911 
270,2.42893603502 
271,2.25667080077 
272,1.9835064324 
273,1.98289142883 
274,2.0349892982 
275,2.04466643772 
276,2.13641683117 
277,2.20603360181 
278,2.47878698023 
279,2.00964397852 
280,2.07122718238 
281,2.17713718861 
282,2.12414045913 
283,1.97739732273 
284,1.99907929261 
285,2.29310345395 
286,2.15969821837 
287,2.28065300017 
288,2.54910773317 
289,2.37627195775 
290,1.97611046154 
291,1.97905911087 
292,2.50801207193 
293,1.97795053957 
294,2.13302699099 
295,2.29303012483 
296,2.24793958746 
297,1.98558421743 
298,2.09651108254 
299,1.98356276765 
300,2.12519309738 
301,2.04890989205 
302,2.01744748561 
303,2.05625224961 
304,2.24437377224 
305,2.28309031223 
306,2.18718954094 
307,1.98769166326 
308,2.35241730785 
309,1.97740484433 
310,2.11162945224 
311,2.06511359774 
312,2.62843187731 
313,2.48712123875 
314,2.36083007713 
315,2.19992963433 
316,2.1926905154 
317,2.25926618852 
318,2.04363170257 
319,2.18944423511 
320,2.39747764343 
321,2.07398082696 
322,2.18389583142 
323,2.35534695952 
324,2.00861514361 
325,2.33129766145 
326,2.67006695821 
327,2.09378100118 
328,2.82840374343 
329,2.01486597631 
330,2.03780945312 
331,2.10011199752 
332,2.16823747121 
333,2.05731291212 
334,2.11382696972 
335,2.04508951043 
336,2.03538569303 
337,2.01979950743 
338,2.09143077142 
339,2.10674512755 
340,2.13619687664 
341,2.09647420193 
342,2.18255540743 
343,2.20627187821 
344,2.04225959058 
345,2.04714357588 
346,1.97812760752 
347,2.21212281148 
348,2.51930713172 
349,2.2472684422 
350,2.10919296336 
351,2.1006950952 
352,2.02442090111 
353,2.56946116806 
354,2.19972798787 
355,2.05766112089 
356,2.0578670248 
357,2.01008899158 
358,2.03333007305 
359,2.2087964195 
360,2.06008944542 
361,2.21896930859 
362,1.97606174621 
363,2.03939929697 
364,2.34262218503 
365,2.10321737229 
366,2.12108749599 
367,2.12920196627 
368,2.63636461577 
369,2.01334331866 
370,1.98112495542 
371,2.33995747838 
372,2.12129405421 
373,2.22615689301 
374,2.02848804124 
375,1.98820268906 
376,2.06200770372 
377,2.09315288653 
378,2.15519940008 
379,2.35276920196 
380,2.07023109682 
381,2.03588039203 
382,2.23499259964 
383,2.10401356596 
384,2.34688729094 
385,2.14627024541 
386,2.0529945549 
387,2.76160919023 
388,2.0631388056 
389,2.24366534626 
390,2.04911497111 
391,2.04796798208 
392,2.02933047013 
393,2.29401321858 
394,2.23955626067 
395,2.04046896396 
396,2.10356551967 
397,2.17503740483 
398,2.3325396137 
399,1.98271788696 
400,2.28080276929 
401,2.23765081304 
402,2.02783268287 
403,2.17705179755 
404,1.98475125001 
405,2.30903599686 
406,2.23103473447 
407,2.00507553239 
408,2.05114028174 
409,2.06253687517 
410,2.31223947231 
411,2.034543447 
412,1.99686982179 
413,1.9990763223 
414,2.00156971987 
415,2.09920079293 
416,2.0291619378 
417,2.10752129488 
418,2.05927768306 
419,2.05553759403 
420,2.42878529791 
421,1.9842054668 
422,2.42608582247 
423,2.21345146063 
424,1.98738788785 
425,2.05536089825 
426,2.37771711332 
427,2.55316446765 
428,2.1180394491 
429,2.13999685021 
430,1.98694167099 
431,2.50105237398 
432,2.03173438516 
433,2.24238519886 
434,2.03078920898 
435,2.26063685408 
436,2.32718273406 
437,2.53024567637 
438,1.97257286699 
439,2.21521302491 
440,1.98854922756 
441,2.03772915531 
442,2.18889110176 
443,2.13056385254 
444,2.25146104721 
445,2.06615918178 
446,2.00164503456 
447,2.00356864432 
448,2.20311615399 
449,2.06229989486 
450,2.09031939963 
451,2.13424913297 
452,2.56837033355 
453,2.22390769218 
454,2.02069732583 
455,2.1611732911 
456,2.08372906197 
457,2.13254607048 
458,2.15167150858 
459,2.00663303997 
460,2.11718497312 
461,2.29526967455 
462,2.01238237481 
463,1.99423488002 
464,2.03692302446 
465,1.98550915089 
466,2.00363764955 
467,2.03283227289 
468,2.2810901903 
469,2.36751227108 
470,1.97237933177 
471,2.69575403559 
472,2.00100376191 
473,1.97573134126 
474,2.09048862251 
475,2.18454282557 
476,2.06369865575 
477,2.50568936843 
478,2.06581059379 
479,2.03758446655 
480,2.42067939836 
481,2.76452867709 
482,2.02333916575 
483,2.01014236212 
484,1.98108170068 
485,2.20495825908 
486,2.22716317179 
487,2.14380958093 
488,2.11085884974 
489,2.18365822467 
490,2.37154941827 
491,2.34280903166 
492,2.07121621942 
493,2.2030862993 
494,2.1309129263 
495,2.03612807705 
496,2.35749509256 
497,2.49439937741 
498,2.15911553284 
499,2.63632634774 
500,2.00595969293 
501,2.02637169616 
502,2.39005765792 
503,2.16554115694 
504,2.03378532181 
505,2.07291847726 
506,2.11192535636 
507,2.0294056377 
508,1.98334470243 
509,2.03535120265 
510,2.0689333602 
511,2.13731883556 
512,2.31583910594 
513,1.99104553717 
514,2.13415669783 
515,2.48652309334 
516,2.54502682996 
517,2.08502935179 
518,2.09711598033 
519,2.16192779973 
520,2.17074990557 
521,2.05971490027 
522,2.27092160629 
523,2.10721199616 
524,2.35636909489 
525,2.07170744435 
526,1.9720041809 
527,2.25569563277 
528,2.14171921691 
529,2.45316097242 
530,2.22479894275 
531,2.16158910306 
532,2.23399826188 
533,2.13721471987 
534,2.03561076752 
535,1.97397683581 
536,2.35240160292 
537,2.47667925816 
538,2.17695651308 
539,2.21120772054 
540,2.09464257469 
541,2.01002791674 
542,2.63883963291 
543,2.23598269629 
544,2.08542408784 
545,2.02049400989 
546,2.06327599945 
547,2.15704166218 
548,2.05045244449 
549,2.00688645745 
550,2.05831815005 
551,2.31555643358 
552,2.10505917089 
553,2.24121956152 
554,1.97423518732 
555,2.00353667518 
556,2.16283387201 
557,2.24588244925 
558,2.2303301189 
559,2.10794344695 
560,2.15619859512 
561,2.04314540919 
562,2.16234655838 
563,2.16968066408 
564,2.46892170804 
565,2.10594616823 
566,2.00108322508 
567,2.2160212954 
568,2.05794465944 
569,2.00402401446 
570,2.06073092172 
571,2.24178922352 
572,2.23434113229 
573,2.26144732084 
574,2.26288270107 
575,1.98430035902 
576,2.10858875523 
577,2.33674904694 
578,2.03633071501 
579,2.161010231 
580,2.49903174662 
581,2.7362280124 
582,2.22863491442 
583,2.17827160082 
584,2.15098447589 
585,2.28186997195 
586,2.23690660835 
587,2.06813564184 
588,2.01310095025 
589,2.38686882175 
590,2.34315711345 
591,2.67335618635 
592,2.04525320635 
593,1.97924373806 
594,2.57403443557 
595,2.03295091931 
596,2.62213657988 
597,2.38494341342 
598,2.24682606984 
599,2.50877571712 
600,2.21888602812 
601,2.16967868515 
602,2.11473688249 
603,1.99115101064 
604,2.11125179697 
605,2.07792131409 
606,2.19201048012 
607,1.97543862144 
608,2.38162624397 
609,2.10555480751 
610,2.66841338456 
611,1.97224265428 
612,2.30399670627 
613,2.05764399185 
614,2.23269366466 
615,2.36823669289 
616,2.0790180685 
617,2.12700676147 
618,1.97312182331 
619,2.07380053289 
620,2.63747536396 
621,2.15123279728 
622,2.16638686478 
623,2.00511230758 
624,2.01972505691 
625,2.34603597779 
626,2.65606135814 
627,2.0743801452 
628,2.09150425728 
629,2.15302387036 
630,2.22847045131 
631,2.30189222814 
632,2.04124028394 
633,2.05919995333 
634,2.25105677248 
635,2.02843641194 
636,2.38812976573 
637,2.04609612729 
638,2.05020596855 
639,2.06058633683 
640,2.18061382018 
641,1.99632892939 
642,2.28942356064 
643,2.03775951473 
644,2.04429808225 
645,2.21053404671 
646,2.5122011705 
647,2.18830619956 
648,2.43838265524 
649,2.49538299707 
650,2.01647633366 
651,2.12271851821 
652,2.10751479587 
653,2.110684595 
654,2.02268261566 
655,2.00629261734 
656,2.01448879493 
657,2.24066470678 
658,2.54193159845 
659,2.06400691792 
660,2.02419113816 
661,2.19164093771 
662,2.32642443796 
663,2.06650413543 
664,2.08704769822 
665,2.1664698896 
666,1.98917712371 
667,2.29251079836 
668,2.08685341072 
669,2.11757733374 
670,2.35496166558 
671,1.98455416596 
672,2.26709556321 
673,2.12849860076 
674,1.97786655086 
675,1.98709003012 
676,2.11293119876 
677,2.11705861892 
678,2.51434914106 
679,1.97049936836 
680,2.04992391803 
681,2.57538150763 
682,2.12796364291 
683,2.03332935803 
684,1.98539975555 
685,2.09276523277 
686,2.32149378405 
687,2.24619255287 
688,2.1589997138 
689,2.53284539209 
690,2.11100605476 
691,2.02508662207 
692,2.07825450277 
693,2.1886612521 
694,2.42005824597 
695,2.07532882292 
696,2.04702424499 
697,2.28578191526 
698,2.10277343464 
699,2.01117864984 
700,2.25190025699 
701,1.97101160399 
702,2.1185124829 
703,2.36613516355 
704,2.11790204728 
705,2.48865312702 
706,2.27418455545 
707,2.24900139809 
708,2.06192687259 
709,1.98405851046 
710,2.41668692925 
711,2.21655000199 
712,2.12756746395 
713,2.03155182594 
714,2.33352422561 
715,2.05546340783 
716,2.41927855608 
717,2.28849871519 
718,2.17097449575 
719,2.35972280586 
720,2.07694638066 
721,2.10657492383 
722,1.99536690484 
723,2.10979216823 
724,1.99540277552 
725,2.01414786296 
726,2.32156094582 
727,2.25703814966 
728,2.22854187899 
729,2.10401762337 
730,2.05123232042 
731,1.97004259419 
732,2.1561112575 
733,2.22473015575 
734,2.05377380162 
735,2.22264120204 
736,2.19107361924 
737,2.4938669635 
738,2.1612451259 
739,2.57430004633 
740,2.24628421824 
741,2.10574104842 
742,2.65991435816 
743,2.02716591597 
744,2.05500574383 
745,2.07844343867 
746,2.32103353777 
747,2.24270707734 
748,2.10472596237 
749,2.01531913885 
750,2.16545848366 
751,2.17697625933 
752,2.09492492086 
753,2.19577432885 
754,2.11135564438 
755,2.1570624823 
756,2.05999844232 
757,2.55999506857 
758,2.49673281564 
759,2.32669292549 
760,2.03492714242 
761,2.02070338337 
762,2.20140459078 
763,2.63576584278 
764,2.00513832139 
765,2.21264343095 
766,2.07969309219 
767,2.11891227918 
768,2.1562752979 
769,2.02707602401 
770,2.26721983625 
771,2.15830125199 
772,2.16875614619 
773,2.13417109121 
774,2.09190520705 
775,2.07283951216 
776,2.6038029609 
777,2.01145549015 
778,2.01299506759 
779,2.02432367037 
780,2.14106054918 
781,2.07951139887 
782,2.3781772563 
783,2.36602893232 
784,2.06385848869 
785,2.01785362278 
786,2.16090614738 
787,2.50629295837 
788,2.18389322013 
789,2.24195397979 
790,2.22725173597 
791,2.02498713763 
792,2.21972238696 
793,2.10996830084 
794,1.98014747684 
795,2.39012733985 
796,2.05925097368 
797,2.10121772495 
798,2.06819464918 
799,2.19595916168 
800,2.37152209313 
801,2.06392059275 
802,2.13241585894 
803,2.02225844813 
804,2.00905292133 
805,2.29072404089 
806,2.0029203227 
807,2.00373701187 
808,1.97696433934 
809,2.12327149698 
810,2.17643081756 
811,2.06468976225 
812,2.07654258871 
813,1.97156396848 
814,2.49503069224 
815,2.2548182183 
816,1.99728619881 
817,2.02953272164 
818,2.13460723788 
819,1.99633872183 
820,2.61704521023 
821,2.53612035154 
822,2.06224770388 
823,2.02587950076 
824,2.45597863673 
825,2.26610309094 
826,2.03078216319 
827,2.29073244665 
828,2.04517978843 
829,1.98748836048 
830,1.98867530758 
831,2.19362966083 
832,2.69482272909 
833,2.2763294077 
834,2.50210431073 
835,2.06365257801 
836,2.17979946127 
837,2.18481802063 
838,2.091263799 
839,2.25892614866 
840,2.3402700991 
841,2.28585710832 
842,2.44401136673 
843,2.04659718691 
844,2.40970146628 
845,2.13902224483 
846,2.13042161981 
847,2.41291447188 
848,1.9920461168 
849,2.02540472367 
850,2.11436992267 
851,1.97582847188 
852,2.14750940483 
853,2.00575558492 
854,2.34697469194 
855,2.18336405124 
856,2.3123079531 
857,2.33163232734 
858,1.97562983186 
859,2.45226867525 
860,1.97656491103 
861,2.3087934293 
862,1.98142271915 
863,2.10912829389 
864,2.23798002317 
865,2.00074635671 
866,2.04858294262 
867,2.01861646689 
868,2.0791051859 
869,2.05246406594 
870,2.17038129398 
871,2.08753734923 
872,2.02803534069 
873,2.07545023675 
874,2.0948222824 
875,2.03715388709 
876,2.10853755914 
877,2.16413814409 
878,2.20706561956 
879,2.18987070704 
880,2.00578048608 
881,2.15883568038 
882,2.38769178103 
883,2.05055367614 
884,2.24485487217 
885,2.68812820642 
886,2.0418270535 
887,2.03113064733 
888,2.25600515746 
889,2.28633072559 
890,2.27266183403 
891,2.02137502364 
892,2.57905760514 
893,2.29050888329 
894,1.99370401617 
895,2.06786472159 
896,2.03826663307 
897,1.98694293889 
898,2.33270721059 
899,2.00509750694 
900,2.17541006541 
901,2.52352188393 
902,2.2859377759 
903,2.12524343066 
904,2.7936605645 
905,2.17141141497 
906,2.21028495485 
907,2.01091306415 
908,2.02195608106 
909,1.97963897866 
910,2.11679854445 
911,2.10894225382 
912,2.13636372691 
913,2.04981597025 
914,2.10875853285 
915,1.99115683207 
916,2.02117689044 
917,2.53318434782 
918,2.3448222256 
919,2.07277675148 
920,2.07559342584 
921,2.2809378715 
922,2.26767737633 
923,2.0334190732 
924,2.11039090706 
925,2.16517887309 
926,2.06624043473 
927,2.09696919287 
928,2.1931760297 
929,2.03233795971 
930,2.25432517046 
931,2.02423847816 
932,2.17980843553 
933,2.03706586342 
934,2.24908640135 
935,2.45656311228 
936,2.27586600079 
937,1.99093354673 
938,2.04492790046 
939,2.03514252277 
940,2.07228707463 
941,2.63836652522 
942,2.07531912252 
943,2.25303921028 
944,2.20884738391 
945,2.32585778244 
946,2.03111616134 
947,2.28386307545 
948,2.09480714004 
949,2.05915312219 
950,1.98277084337 
951,2.07082242378 
952,2.042581736 
953,2.03224425659 
954,2.39317996237 
955,2.16090258071 
956,2.11283660006 
957,2.06391597365 
958,2.23302181066 
959,1.99546544887 
960,2.23564431775 
961,2.03184238184 
962,2.37087033665 
963,2.01670084737 
964,2.0392056242 
965,2.44274869264 
966,2.11894730505 
967,2.24811230984 
968,2.44456755916 
969,2.25741469052 
970,2.33851910035 
971,2.61246925422 
972,1.97048384444 
973,1.99273386388 
974,2.16160652982 
975,2.23905015286 
976,2.38603002993 
977,2.27896816403 
978,2.29899172387 
979,2.28331675563 
980,2.28893395226 
981,2.05427789111 
982,2.20675989325 
983,1.99485439777 
984,1.97667533923 
985,2.12639586267 
986,1.99895691722 
987,2.04289816799 
988,2.28610268438 
989,2.26140341023 
990,2.17011390724 
991,2.42062635889 
992,2.1703313327 
993,2.08745456155 
994,2.60029420072 
995,1.98882359953 
996,2.2947492818 
997,2.3949518352 
998,2.01648936507 
999,2.32420523549 
1000,1.9823609948 
1001,2.0067281779 
1002,2.08863282695 
1003,2.29774387328 
1004,2.52921937895 
1005,2.22179557639 
1006,2.25001596752 
1007,2.26861352666 
1008,2.36276490259 
1009,2.34748026709 
1010,2.03076267159 
1011,2.3618908074 
1012,2.07996743369 
1013,1.97985594021 
1014,2.34533952557 
1015,2.15633600891 
1016,2.45472443811 
1017,2.18981373259 
1018,2.01158964649 
1019,2.69031497918 
1020,2.08951945517 
1021,1.9835532142 
1022,2.00302433385 
1023,2.10890882045 
1024,2.05862950759 
1025,2.37191457176 
1026,2.10165093629 
1027,2.61206640508 
1028,2.09303128281 
1029,2.04016067491 
1030,2.27106547391 
1031,2.0941919694 
1032,2.03861694893 
1033,2.11064598277 
1034,2.01454506785 
1035,2.07210637988 
1036,1.97717460984 
1037,2.19691836619 
1038,2.02730698984 
1039,2.6064925453 
1040,2.36687156132 
1041,2.42443279688 
1042,2.07762501284 
1043,2.15357963664 
1044,2.59844034396 
1045,2.4049942217 
1046,2.17267881553 
1047,2.06350614099 
1048,2.12281845455 
1049,2.26807131654 
1050,2.45640985825 
1051,2.52554067298 
1052,2.20827303939 
1053,2.31698314619 
1054,2.15317596861 
1055,1.97049975525 
1056,2.02234296766 
1057,2.05874976305 
1058,2.01881135517 
1059,2.530776019 
1060,2.20818843768 
1061,2.24384488565 
1062,1.97232093786 
1063,2.02802206306 
1064,2.03312355085 
1065,2.14701740812 
1066,2.20825400022 
1067,2.30838332863 
1068,2.03129235596 
1069,1.99873641993 
1070,2.67592424075 
1071,2.41307651236 
1072,2.26514906562 
1073,2.00226382484 
1074,2.05825711983 
1075,2.07976892546 
1076,2.32856458938 
1077,2.09420726404 
1078,2.39897306998 
1079,2.08527680364 
1080,2.47420966601 
1081,2.50846782805 
1082,2.59662001548 
1083,2.55869445505 
1084,2.15083426008 
1085,2.32099618649 
1086,2.21617312555 
1087,2.06143189227 
1088,2.14006141829 
1089,2.03651267414 
1090,2.38422184092 
1091,2.05689957734 
1092,2.42923782017 
1093,2.04576556521 
1094,2.26537735844 
1095,2.23641080582 
1096,2.66038017152 
1097,2.71672090997 
1098,2.00103521097 
1099,2.43218089209 
1100,2.0797822978 
1101,2.13093127912 
1102,2.36964478507 
1103,2.17666745853 
1104,2.03106378412 
1105,2.1289664923 
1106,2.3250546578 
1107,2.00005038187 
1108,2.06816747253 
1109,2.02723430774 
1110,2.62478598482 
1111,1.98306680153 
1112,1.97959954989 
1113,2.06769257725 
1114,2.06407162118 
1115,2.01009355651 
1116,2.25118872085 
1117,2.39688808901 
1118,2.25977068495 
1119,2.07172475693 
1120,2.00900513147 
1121,2.09471663906 
1122,2.21880894747 
1123,2.18232354606 
1124,2.01394848595 
1125,2.02189653944 
1126,2.03799402434 
1127,2.12595042252 
1128,2.2264419417 
1129,1.99696386557 
1130,2.04163315575 
1131,2.01738007499 
1132,1.99073252279 
1133,2.37124849352 
1134,1.99438731169 
1135,2.0326936428 
1136,2.19280099957 
1137,2.50709039562 
1138,2.25973726013 
1139,2.29581496042 
1140,2.06529942722 
1141,2.01771527176 
1142,1.97011821497 
1143,2.006958838 
1144,2.1796530639 
1145,2.02771659022 
1146,2.07351744071 
1147,2.06096158763 
1148,2.00854927868 
1149,1.99729966134 
1150,2.08201578306 
1151,2.02619193584 
1152,1.97844059811 
1153,2.00071097322 
1154,2.0462636977 
1155,2.5576339733 
1156,2.44996602116 
1157,2.20105616077 
1158,2.09270575564 
1159,2.02794518182 
1160,2.06875265827 
1161,2.30431452337 
1162,2.06693068812 
1163,2.19402248976 
1164,2.0136539804 
1165,2.04484832004 
1166,1.99926767374 
1167,2.16910748187 
1168,1.9896346544 
1169,2.0265811594 
1170,2.25825158201 
1171,2.08157232867 
1172,2.09881047456 
1173,2.36606551555 
1174,2.01819883343 
1175,2.14832435185 
1176,2.13014876986 
1177,2.26989475581 
1178,2.36969616707 
1179,2.23046470971 
1180,1.9725140219 
1181,2.27415077268 
1182,2.18650801484 
1183,2.50081656476 
1184,1.97382868446 
1185,2.5234294624 
1186,2.15019845692 
1187,1.98533948133 
1188,2.10171249142 
1189,2.42851865717 
1190,2.45648157757 
1191,2.57566019927 
1192,2.42843231893 
1193,1.98638041629 
1194,1.97981629724 
1195,2.06586553805 
1196,2.06792207857 
1197,2.01491629542 
1198,1.99083543658 
1199,1.98029726303 
1200,2.02453033201 
1201,2.41679192401 
1202,2.22100200468 
1203,2.1585043276 
1204,1.97412612299 
1205,1.9958551108 
1206,1.99379104192 
1207,2.14346193089 
1208,2.16482259118 
1209,2.49513935209 
1210,2.11785399045 
1211,2.30808731652 
1212,1.98052669528 
1213,2.15837928834 
1214,2.23748676939 
1215,2.37266025316 
1216,2.07067818495 
1217,2.07254205918 
1218,2.2645750098 
1219,2.03240654447 
1220,2.41622934456 
1221,2.88258961449 
1222,2.39588358308 
1223,2.00703191907 
1224,2.20876516684 
1225,1.97130151736 
1226,2.47807826392 
1227,2.04459749029 
1228,2.56832784324 
1229,2.25588789007 
1230,2.25446731389 
1231,2.10759248351 
1232,2.19906081307 
1233,2.0886059499 
1234,2.01254022849 
1235,1.9909253103 
1236,2.18995149765 
1237,1.98658532679 
1238,2.49051283818 
1239,2.05589968648 
1240,2.06653077105 
1241,2.00136006829 
1242,2.21493814853 
1243,1.9958644159 
1244,2.04011055652 
1245,2.16279381385 
1246,2.03089973593 
1247,2.43740307039 
1248,2.12297085065 
1249,2.01449672468 
1250,2.09219141314 
1251,2.08236841426 
1252,2.185585387 
1253,2.18302631084 
1254,2.14611068194 
1255,2.00470670477 
1256,2.23173705795 
1257,2.26217548533 
1258,2.22099420951 
1259,2.07261412265 
1260,2.01695614871 
1261,2.59634694124 
1262,2.02762097241 
1263,2.09376746939 
1264,2.231016793 
1265,2.20772232595 
1266,1.97919820661 
1267,2.14019032844 
1268,2.46665114946 
1269,2.32387451152 
1270,2.02887967379 
1271,2.77388956118 
1272,2.08118157701 
1273,2.35167810692 
1274,2.08922649978 
1275,2.00383516639 
1276,1.99435179937 
1277,2.80991479947 
1278,2.15145316094 
1279,2.06082448516 
1280,2.27578473439 
1281,2.0338049072 
1282,2.18314114632 
1283,2.02732827259 
1284,2.1609901473 
1285,1.99711048819 
1286,2.52165803569 
1287,2.47942436008 
1288,2.19334598499 
1289,2.04365693512 
1290,2.0688390038 
1291,2.32586046103 
1292,2.16325757627 
1293,2.13739957851 
1294,2.06031150739 
1295,2.13305077153 
1296,2.15086704995 
1297,2.06657516932 
1298,1.97173567549 
1299,2.62050632131 
1300,2.45771727077 
1301,2.41048273262 
1302,1.97649433829 
1303,1.97359384463 
1304,2.16789823565 
1305,2.14781910936 
1306,1.99162476444 
1307,2.2090908235 
1308,1.98174584391 
1309,2.28579319945 
1310,1.99106495884 
1311,2.02396599615 
1312,2.39940736561 
1313,2.10526517449 
1314,2.33068239432 
1315,2.34966818615 
1316,2.35532823823 
1317,2.01150064802 
1318,2.65752830677 
1319,2.60271922484 
1320,2.12555583846 
1321,2.25831449928 
1322,2.43874130984 
1323,2.12226938493 
1324,2.25506036247 
1325,2.06739460996 
1326,2.30710962665 
1327,1.9728534716 
1328,2.11696734448 
1329,2.00778459726 
1330,2.01237661847 
1331,2.09823644381 
1332,2.19662856368 
1333,2.86605935989 
1334,2.16108377126 
1335,2.29892168479 
1336,2.11458549205 
1337,2.70434755675 
1338,2.03438825143 
1339,2.02466707517 
1340,2.15911617406 
1341,1.98583944933 
1342,2.86261213749 
1343,2.19041056829 
1344,2.10621746265 
1345,2.09683615446 
1346,2.62907451385 
1347,2.19859142798 
1348,2.04157870372 
1349,1.98497612664 
1350,2.26163111024 
1351,2.00641626313 
1352,2.21069272264 
1353,2.22056245595 
1354,2.53083179243 
1355,2.35151566317 
1356,2.13702060975 
1357,2.12515097982 
1358,2.13300808035 
1359,2.18829567842 
1360,2.23452086574 
1361,2.23433962932 
1362,2.44525458578 
1363,1.98676640913 
1364,2.37001301046 
1365,2.04339017859 
1366,2.1350074302 
1367,2.43661445694 
1368,1.98533288514 
1369,1.98250119939 
1370,2.16098049262 
1371,2.30648229234 
1372,2.0655022348 
1373,2.40816930398 
1374,2.19710167988 
1375,1.99111602713 
1376,2.23835781492 
1377,2.41646262598 
1378,2.02266396189 
1379,1.99002941764 
1380,2.36512274088 
1381,2.35623550301 
1382,2.02503810742 
1383,2.04581612681 
1384,2.03750108515 
1385,2.11498438863 
1386,2.22839396469 
1387,2.31787527956 
1388,1.99883784652 
1389,2.09371952753 
1390,2.09018406785 
1391,1.99845749305 
1392,2.04726116751 
1393,2.01046622926 
1394,2.14311242123 
1395,2.6191831311 
1396,2.24415356362 
1397,2.19735877185 
1398,2.07233223688 
1399,2.16092729129 
1400,2.34199152387 
1401,2.03248461847 
1402,2.08845015476 
1403,2.45728220024 
1404,2.46586546809 
1405,2.04115386813 
1406,1.97420794968 
1407,2.2425068522 
1408,2.1069393252 
1409,2.05283469385 
1410,2.12570180924 
1411,2.08724508015 
1412,2.04442350621 
1413,2.03908041701 
1414,2.1640287307 
1415,2.22614831265 
1416,2.06849108082 
1417,2.04167066395 
1418,2.17099084089 
1419,2.26162931016 
1420,2.12649892105 
1421,1.97542440538 
1422,2.02329100789 
1423,1.98558524593 
1424,2.06485843771 
1425,2.39237542748 
1426,2.61764667698 
1427,2.03820195886 
1428,2.08142984927 
1429,2.62500826316 
1430,2.00812472438 
1431,2.04047709333 
1432,2.5417448368 
1433,2.24298383347 
1434,2.12011328052 
1435,2.01452036071 
1436,2.02149408479 
1437,2.23602071194 
1438,2.04689646144 
1439,2.48608228135 
1440,2.20411076594 
1441,2.24562715259 
1442,2.1303810247 
1443,2.10330478134 
1444,2.01557614452 
1445,2.34334923288 
1446,2.52470058862 
1447,2.6788002746 
1448,2.29819612481 
1449,2.22097652859 
1450,2.13844525559 
1451,2.27959415485 
1452,1.97428366409 
1453,2.114412323 
1454,2.1763088249 
1455,2.07664398534 
1456,2.02459151263 
1457,2.21665279725 
1458,2.20044296349 
1459,2.6300751415 
1460,2.13013516615 
1461,2.07264309842 
1462,2.18299105227 
1463,2.38142991303 
1464,2.14745834704 
1465,1.98459568183 
1466,2.03868182151 
1467,2.25806639568 
1468,2.20390772566 
1469,2.74107598824 
1470,2.14631952866 
1471,2.03613084648 
1472,2.19083765425 
1473,2.45620070567 
1474,2.03177306893 
1475,2.6343896667 
1476,2.35298106216 
1477,2.03064055989 
1478,2.01130344878 
1479,2.03280880391 
1480,2.00578162084 
1481,2.07683413601 
1482,2.12483869059 
1483,2.09209296476 
1484,2.50443380255 
1485,2.2909983203 
1486,2.27347833903 
1487,2.16838260558 
1488,2.1568987141 
1489,2.59105090982 
1490,2.05174415901 
1491,2.28201969859 
1492,2.20725732677 
1493,2.06752213878 
1494,2.06916916435 
1495,2.06709994301 
1496,2.45766019864 
1497,2.05577116537 
1498,2.0099626677 
1499,2.17877404906 
1500,2.39842323874 
1501,2.06435026106 
1502,2.65660303498 
1503,2.46977270631 
1504,2.32397808223 
1505,2.15553190191 
1506,2.01095748914 
1507,2.02985527862 
1508,2.31709583252 
1509,2.56024099473 
1510,2.11580894987 
1511,2.00183376138 
1512,1.9808152316 
1513,2.03595936511 
1514,2.04403527196 
1515,2.53844549827 
1516,2.45811956868 
1517,2.09783147511 
1518,2.0273766129 
1519,2.31553728391 
1520,2.21997461292 
1521,2.21022364098 
1522,1.99115597498 
1523,1.99485269779 
1524,2.04556659627 
1525,2.25958640202 
1526,2.56969819545 
1527,2.02018251448 
1528,2.53819845182 
1529,2.26804298885 
1530,2.07070623419 
1531,2.08470753964 
1532,2.2186138945 
1533,2.04330868193 
1534,2.06413474079 
1535,2.07457138767 
1536,2.08111192542 
1537,2.0506620683 
1538,2.03168169269 
1539,2.07991237602 
1540,2.02583929221 
1541,2.01040952877 
1542,1.9934154057 
1543,2.03274285868 
1544,2.18525227397 
1545,2.12591470287 
1546,2.12244759182 
1547,1.9794836592 
1548,2.03036469278 
1549,2.02687843779 
1550,2.32555947958 
1551,2.2267409858 
1552,2.31153836587 
1553,2.43127257482 
1554,2.39985557268 
1555,2.15998855203 
1556,1.99382725432 
1557,2.06088605501 
1558,2.0906469056 
1559,2.00943263986 
1560,2.57885997954 
1561,2.30530042493 
1562,2.27270515312 
1563,2.00600437532 
1564,2.004589955 
1565,2.29696799647 
1566,2.07728632618 
1567,2.34509039184 
1568,2.04536872249 
1569,2.49512256971 
1570,2.52162229823 
1571,2.03443348457 
1572,2.07405086067 
1573,2.28538681207 
1574,2.00028345576 
1575,2.31635562404 
1576,2.08742402419 
1577,2.07891886196 
1578,2.28681359694 
1579,2.26670900306 
1580,2.23066625195 
1581,2.09863472161 
1582,2.0684068965 
1583,2.69662885078 
1584,2.30691374894 
1585,2.31088493751 
1586,1.97538298354 
1587,2.50516911653 
1588,1.98493248781 
1589,2.1392724277 
1590,2.01995797412 
1591,1.99989059648 
1592,2.00069207084 
1593,2.03753464922 
1594,2.45074238601 
1595,2.01562343831 
1596,2.16840533569 
1597,2.11056608355 
1598,1.99770769487 
1599,2.42198672701 
1600,2.32351681018 
1601,2.58086148218 
1602,2.13588396943 
1603,2.55350781518 
1604,2.28021014316 
1605,2.12399958273 
1606,1.98740430101 
1607,2.16563844021 
1608,1.97817507539 
1609,2.10166548582 
1610,2.63198786085 
1611,2.61942255921 
1612,2.09096904974 
1613,2.08436305484 
1614,2.06322485925 
1615,1.98716999766 
1616,2.05554135067 
1617,1.99008478344 
1618,1.97604855493 
1619,2.03217801627 
1620,2.22196394459 
1621,2.34351111935 
1622,2.04437020492 
1623,2.64995537681 
1624,2.12051886694 
1625,2.3874228323 
1626,2.12014320522 
1627,2.07670007423 
1628,2.17595306677 
1629,2.02176587462 
1630,2.09170957795 
1631,2.24245420806 
1632,2.32145842502 
1633,2.06981792117 
1634,2.37142078701 
1635,1.97236263582 
1636,1.97660757352 
1637,2.06405331864 
1638,2.15584913583 
1639,2.69257407744 
1640,2.02156139047 
1641,2.26492561665 
1642,2.17402225001 
1643,1.97070609003 
1644,1.97899145096 
1645,1.97502617638 
1646,1.9742702147 
1647,2.0876742209 
1648,2.3839626167 
1649,2.14196470955 
1650,2.6014563966 
1651,2.43481155113 
1652,2.13386527321 
1653,2.49456231751 
1654,2.18242094897 
1655,2.21596517221 
1656,2.02361301562 
1657,2.39986510149 
1658,2.43003816724 
1659,2.5220894408 
1660,2.06910826759 
1661,2.14765713882 
1662,2.14038615664 
1663,2.27053798252 
1664,2.34821831412 
1665,1.97372443148 
1666,2.23558216764 
1667,2.5301787637 
1668,2.38750148534 
1669,2.36394498101 
1670,2.11152321499 
1671,2.03585095729 
1672,1.98330953749 
1673,2.2231534864 
1674,2.2825251534 
1675,2.57698648544 
1676,2.22661105812 
1677,2.29728947807 
1678,2.06992793371 
1679,2.14980544738 
1680,2.17574380709 
1681,1.98078546933 
1682,2.02867119979 
1683,2.22707159275 
1684,2.02027827812 
1685,2.23558657486 
1686,2.12060253867 
1687,2.16719303353 
1688,2.03157284142 
1689,2.25378215086 
1690,2.21242693828 
1691,2.41754535246 
1692,2.47747543104 
1693,2.10020996485 
1694,2.73414598643 
1695,2.11805966452 
1696,2.10588942817 
1697,2.01688811781 
1698,2.17731669742 
1699,2.26597686603 
1700,2.75290205964 
1701,2.25237721307 
1702,2.47391923491 
1703,1.99212963338 
1704,2.14341761876 
1705,2.057594369 
1706,2.13788484555 
1707,2.38281310916 
1708,2.08483821552 
1709,2.12253404427 
1710,2.0863184184 
1711,2.26791988099 
1712,2.4263964745 
1713,2.40363265543 
1714,2.10222322415 
1715,2.049836073 
1716,2.17716973878 
1717,1.97757681919 
1718,2.20397994096 
1719,1.97386754227 
1720,2.2307180855 
1721,2.1230243026 
1722,2.26504147501 
1723,2.02238361204 
1724,2.04526954156 
1725,2.03427659165 
1726,2.49127416731 
1727,2.08761733258 
1728,2.27686432049 
1729,2.00712608387 
1730,1.99460333584 
1731,2.45907506867 
1732,2.06936355598 
1733,1.99913410951 
1734,1.98422025094 
1735,1.99148959582 
1736,2.17355523142 
1737,2.25137794216 
1738,2.04952342958 
1739,2.00973046304 
1740,2.2555399463 
1741,2.20156820177 
1742,2.06186482126 
1743,2.03528649671 
1744,2.72752780089 
1745,2.05157436685 
1746,2.22473716792 
1747,1.9861687279 
1748,2.01078554311 
1749,2.15727380261 
1750,2.50812642562 
1751,2.80818121747 
1752,2.27845006025 
1753,2.02450447403 
1754,2.2810671458 
1755,2.03834577216 
1756,2.20262926369 
1757,2.01271106464 
1758,2.24642432532 
1759,2.1911221546 
1760,2.06942798628 
1761,1.97210832745 
1762,2.02627567223 
1763,2.30436794416 
1764,1.97680356848 
1765,2.11714554379 
1766,2.00136586181 
1767,2.38827028734 
1768,2.07093628726 
1769,1.97940947815 
1770,2.32192744707 
1771,2.0194166501 
1772,1.97187226934 
1773,2.41719348708 
1774,2.23800657511 
1775,2.01980140746 
1776,2.12013997064 
1777,2.40201984519 
1778,2.08552993157 
1779,2.05654396336 
1780,2.09166461426 
1781,2.08720174104 
1782,1.98798666597 
1783,2.05006878379 
1784,1.99971073464 
1785,2.22259758252 
1786,2.14105736677 
1787,2.05067505281 
1788,2.12227777161 
1789,2.16770829599 
1790,2.22911779647 
1791,2.37422647869 
1792,2.08015230973 
1793,2.05617339752 
1794,2.06941900824 
1795,1.99792657132 
1796,2.02299365726 
1797,2.25794658617 
1798,2.14718766541 
1799,2.18404094408 
1800,2.14310516256 
1801,2.1009735189 
1802,2.19180440508 
1803,2.10416850779 
1804,2.06623461111 
1805,1.99679991162 
1806,2.24579072452 
1807,2.03929087424 
1808,2.05974981186 
1809,1.97509510931 
1810,2.05389632618 
1811,1.99955809752 
1812,2.08082174624 
1813,2.08315874632 
1814,2.05913907912 
1815,2.14275922211 
1816,2.03213792213 
1817,2.36737828092 
1818,2.05567341816 
1819,2.18883376906 
1820,2.24003588775 
1821,2.00175586388 
1822,2.06915753338 
1823,2.0446723554 
1824,2.02433435577 
1825,2.2152687939 
1826,2.60091880463 
1827,2.17248019728 
1828,2.32930073233 
1829,2.16904372383 
1830,2.12452943842 
1831,2.09679797639 
1832,2.05076828074 
1833,2.07400436021 
1834,2.1703524314 
1835,2.13257363046 
1836,2.03841126765 
1837,2.02239464471 
1838,2.06392753363 
1839,2.25445428933 
1840,2.13007352844 
1841,1.97878381681 
1842,2.17799652089 
1843,2.11530411605 
1844,2.04776278123 
1845,2.08308009341 
1846,1.97633576919 
1847,2.21940724987 
1848,1.99149412338 
1849,2.30164979169 
1850,1.97482051345 
1851,2.218369027 
1852,2.01606813495 
1853,2.15474718924 
1854,1.99318240168 
1855,2.51141790392 
1856,1.9976009897 
1857,1.97918462744 
1858,2.17258955366 
1859,2.17454959801 
1860,2.09575956959 
1861,2.15825001464 
1862,2.27724225378 
1863,2.11741362206 
1864,2.06153079993 
1865,2.06535461599 
1866,2.17071933739 
1867,2.08930478968 
1868,2.16521238098 
1869,2.53206605794 
1870,2.10400026689 
1871,2.19595207113 
1872,2.00113307162 
1873,2.55792073684 
1874,2.02437268434 
1875,2.37377158953 
1876,2.12155502709 
1877,1.98064956976 
1878,2.03804448786 
1879,2.08720367674 
1880,2.08265405849 
1881,1.99109976623 
1882,2.3570558146 
1883,2.00672526201 
1884,2.29845386265 
1885,2.52812618136 
1886,2.3521533665 
1887,2.15669763211 
1888,2.12271668601 
1889,2.02553093615 
1890,2.02489524252 
1891,2.29416853919 
1892,1.99860874396 
1893,2.17062234169 
1894,2.1252100709 
1895,2.30989816561 
1896,2.57510928745 
1897,2.07313280321 
1898,2.1907661614 
1899,2.01832769385 
1900,2.02996968339 
1901,1.99815436821 
1902,2.01416400157 
1903,2.21003271142 
1904,2.13083569785 
1905,2.01119494812 
1906,2.00288111979 
1907,1.9793815323 
1908,2.24992014391 
1909,2.46556626641 
1910,2.23061156075 
1911,2.65655308814 
1912,2.36748338195 
1913,2.07712288116 
1914,2.00256001706 
1915,1.97354261246 
1916,2.35634157534 
1917,2.05570994632 
1918,2.03879754899 
1919,2.07766066391 
1920,2.25243809373 
1921,2.12802089056 
1922,2.26915832065 
1923,2.26340348015 
1924,2.09709056818 
1925,2.1140499964 
1926,2.1483854794 
1927,1.97857493257 
1928,2.14868992883 
1929,2.15500034223 
1930,2.24307115376 
1931,2.34322014142 
1932,1.99916005755 
1933,2.12027897728 
1934,1.99755226606 
1935,2.09573008374 
1936,2.50839893447 
1937,2.14571761201 
1938,2.19806054481 
1939,2.1159736001 
1940,2.25493785357 
1941,2.03317215106 
1942,2.226324814 
1943,2.24838108291 
1944,2.08788712561 
1945,2.05028473213 
1946,1.976071259 
1947,2.00358800387 
1948,2.04270928082 
1949,1.99646559683 
1950,2.09999122301 
1951,1.97951383565 
1952,2.17178791647 
1953,1.99675225062 
1954,2.44798259794 
1955,2.04108658023 
1956,2.38937839953 
1957,2.38674356375 
1958,2.01001783192 
1959,2.36492307588 
1960,2.16659058212 
1961,2.44569245456 
1962,2.08014835576 
1963,2.4659788339 
1964,2.0064546665 
1965,2.13652942458 
1966,2.22024800671 
1967,1.97279302175 
1968,2.1063065544 
1969,2.01640055278 
1970,2.17230314293 
1971,2.55148541747 
1972,2.30333237852 
1973,2.1508958011 
1974,2.05812125131 
1975,2.07383779479 
1976,1.97094631934 
1977,1.98186346767 
1978,2.39206678155 
1979,2.15828497247 
1980,2.35546712494 
1981,2.27200837523 
1982,2.14729260226 
1983,2.18784030955 
1984,2.61324097192 
1985,2.2721779261 
1986,2.06342048567 
1987,2.0293575244 
1988,2.05041845272 
1989,2.0619570789 
1990,1.98445147074 
1991,2.07959823223 
1992,2.32317668363 
1993,2.47736701226 
1994,2.04282526139 
1995,2.2834713956 
1996,2.57934250718 
1997,2.25637870641 
1998,2.10951608173 
1999,2.19024945092 
2000,2.0087234971 
2001,2.43052963955 
2002,2.30361747663 
2003,2.40189590832 
2004,2.28651969481 
2005,1.98875623424 
2006,1.98366859225 
2007,2.0471014164 
2008,2.06417439327 
2009,2.46314786036 
2010,2.01123904425 
2011,2.0886589525 
2012,2.06744081562 
2013,2.69386866285 
2014,1.97845955213 
2015,2.42708399154 
2016,2.38383986544 
2017,2.15637923796 
2018,2.18630739282 
2019,2.09805228849 
2020,2.28597100662 
2021,2.25601938571 
2022,2.37775075117 
2023,1.97765394887 
2024,2.02924182378 
2025,1.98377086515 
2026,2.05603759642 
2027,2.1307119244 
2028,2.09641346654 
2029,1.97087594474 
2030,2.12296443021 
2031,2.04644052005 
2032,2.33844016243 
2033,2.20599828409 
2034,2.02825601633 
2035,2.00565334178 
2036,1.98858543011 
2037,2.14965753581 
2038,2.29396285532 
2039,2.0173721179 
2040,2.27266630314 
2041,2.0855926905 
2042,2.1388360905 
2043,2.06064086984 
2044,2.0531592903 
2045,2.00510058032 
2046,2.0684434302 
2047,2.11272867007 
2048,2.39324941882 
2049,2.12405203155 
2050,2.34597904128 
2051,2.04669444472 
2052,1.99158702231 
2053,2.07933435373 
2054,2.31510470671 
2055,2.05948834219 
2056,2.05101311224 
2057,2.23401615696 
2058,2.12234954862 
2059,2.27591217674 
2060,2.02600260323 
2061,2.05230161705 
2062,2.2207912835 
2063,2.08797889592 
2064,2.46038467289 
2065,1.9808871521 
2066,2.8332178411 
2067,2.20907214259 
2068,2.27874215888 
2069,2.00585733406 
2070,2.24317872062 
2071,2.03015926866 
2072,2.17002226794 
2073,2.01510999509 
2074,2.40940469805 
2075,1.99953459964 
2076,2.07981610978 
2077,2.23826129258 
2078,2.32717883942 
2079,2.1563605718 
2080,2.03047840629 
2081,2.26216744885 
2082,2.41309039056 
2083,2.03302672848 
2084,2.13072366224 
2085,2.19645210936 
2086,2.01467249656 
2087,2.44023102618 
2088,2.52766007478 
2089,2.02177192146 
2090,1.97636852818 
2091,2.54417272984 
2092,2.35809060395 
2093,2.30758421266 
2094,2.24926681034 
2095,2.17555009312 
2096,2.29580880991 
2097,2.10916835214 
2098,2.05562874061 
2099,2.24240587359 
2100,2.02828782949 
2101,2.02377221377 
2102,2.10285896269 
2103,2.05193964106 
2104,2.27672806653 
2105,2.00917179974 
2106,2.19605027207 
2107,2.35889737519 
2108,2.13864746578 
2109,2.28084947559 
2110,2.16862582811 
2111,2.16099602495 
2112,2.08681448312 
2113,2.02617451124 
2114,2.12573519801 
2115,2.08807650667 
2116,2.0320452615 
2117,1.99542827381 
2118,2.09026973795 
2119,2.13605341268 
2120,2.00481949289 
2121,2.36299439147 
2122,2.0992224445 
2123,2.1810686352 
2124,2.16104127428 
2125,2.0870578149 
2126,2.14365755084 
2127,1.98490117077 
2128,2.00959573055 
2129,1.97306357249 
2130,2.02799091161 
2131,2.40036501335 
2132,2.45573221992 
2133,2.14985727343 
2134,2.18843261837 
2135,2.35870881223 
2136,2.01156372657 
2137,2.35156052085 
2138,2.1537981062 
2139,2.02831310821 
2140,2.14786820854 
2141,2.38385443491 
2142,1.99191833865 
2143,2.00563786775 
2144,2.0977189918 
2145,1.9854683708 
2146,2.04509647891 
2147,1.99515309209 
2148,2.18930220729 
2149,2.24014866145 
2150,2.14025640035 
2151,2.05994118762 
2152,2.56034878787 
2153,2.06751445696 
2154,2.01134363697 
2155,2.32424246005 
2156,2.18159669659 
2157,2.10018097874 
2158,2.05319871453 
2159,2.41421973985 
2160,2.10276946942 
2161,2.12124113962 
2162,1.98531972862 
2163,2.03447233248 
2164,2.4541927336 
2165,2.0242273071 
2166,2.03273519527 
2167,2.06926982399 
2168,2.30917533058 
2169,2.37117857889 
2170,2.09499808299 
2171,2.13801854541 
2172,2.06955349799 
2173,2.12918246785 
2174,1.98536313282 
2175,2.32661843613 
2176,2.21737478027 
2177,2.34881310716 
2178,2.53528918721 
2179,2.0143546221 
2180,2.08833965825 
2181,2.01307385978 
2182,2.26681557097 
2183,2.00260160975 
2184,2.05403666462 
2185,2.00477366897 
2186,2.08762232196 
2187,2.29744892702 
2188,2.43465199719 
2189,2.14156274597 
2190,2.2291430492 
2191,2.17647084993 
2192,2.08312569722 
2193,2.00784057931 
2194,2.04198152046 
2195,2.29763305979 
2196,2.16973877428 
2197,2.02248530048 
2198,2.14161634564 
2199,2.13961477983 
2200,2.27946978546 
2201,2.21865505191 
2202,2.1921302323 
2203,2.2619690288 
2204,2.36436274515 
2205,1.9791370712 
2206,1.98646786792 
2207,2.38072323072 
2208,2.09042774999 
2209,1.99089592668 
2210,2.06752180745 
2211,2.00092044637 
2212,2.2643384963 
2213,1.98084046418 
2214,2.16229338533 
2215,2.19735115228 
2216,2.55021196646 
2217,2.01510152082 
2218,2.04197831951 
2219,2.22942808179 
2220,2.1713663908 
2221,2.07871238217 
2222,2.05519124835 
2223,2.30487484573 
2224,2.26008464792 
2225,1.99897449647 
2226,2.12794362424 
2227,2.02556863955 
2228,2.011955117 
2229,2.02437999901 
2230,1.97938549048 
2231,2.09594107387 
2232,2.01409161546 
2233,2.33259043389 
2234,2.23290359595 
2235,2.1897825094 
2236,2.15048589666 
2237,2.20901302984 
2238,1.98087678532 
2239,2.35689900611 
2240,2.01375748907 
2241,2.02969832169 
2242,2.01894649445 
2243,2.10227917485 
2244,2.19573560789 
2245,2.06052062692 
2246,2.13403476343 
2247,1.97342203693 
2248,1.99647934052 
2249,2.1593688313 
2250,2.43958428305 
2251,2.12615892472 
2252,2.10239348529 
2253,2.16888635774 
2254,2.01891965936 
2255,2.14264695552 
2256,2.04349344559 
2257,2.17650444096 
2258,2.07722159442 
2259,2.69351338007 
2260,2.03036277921 
2261,2.10113321457 
2262,2.27012543067 
2263,2.01190989265 
2264,2.04125468316 
2265,2.08948814938 
2266,1.97695660387 
2267,2.41103561952 
2268,2.08659705767 
2269,2.22404961749 
2270,2.37901098708 
2271,2.3735762263 
2272,2.26890989167 
2273,2.12994816395 
2274,2.09544526797 
2275,2.05738318387 
2276,2.46177440882 
2277,2.19679210175 
2278,2.2087744233 
2279,2.17969367392 
2280,2.07083850291 
2281,1.98928174051 
2282,2.42283271597 
2283,2.34921003284 
2284,2.24289671814 
2285,2.15506907779 
2286,1.98712546031 
2287,2.06652446796 
2288,2.00530921933 
2289,2.27891986267 
2290,1.98420635482 
2291,2.09128149443 
2292,2.02159783763 
2293,2.20471490504 
2294,1.970373741 
2295,2.10960503473 
2296,1.97940649016 
2297,1.99207079418 
2298,2.48632644999 
2299,2.0275808559 
2300,1.97442174537 
2301,2.13360713448 
2302,2.07108661928 
2303,1.97603354758 
2304,2.01610885454 
2305,2.00374291322 
2306,2.35964377789 
2307,2.37551856921 
2308,2.47501061392 
2309,2.11361371018 
2310,2.34360404399 
2311,2.11580986024 
2312,1.99485698015 
2313,2.43143857272 
2314,2.15435926258 
2315,2.22372864613 
2316,2.20680519925 
2317,2.16953664209 
2318,2.12947860796 
2319,2.43834517362 
2320,2.10287124352 
2321,2.0955377634 
2322,2.05472797791 
2323,1.98102948171 
2324,2.35436483248 
2325,2.03919990386 
2326,2.22800088374 
2327,2.03718738223 
2328,2.56065617693 
2329,2.1344933363 
2330,2.18029314174 
2331,2.37314821284 
2332,1.99213719778 
2333,2.04521332112 
2334,2.0554359725 
2335,2.27200540184 
2336,1.996206723 
2337,2.14385098736 
2338,2.52587192788 
2339,2.76871577737 
2340,2.32225811767 
2341,2.12174448237 
2342,2.30315036443 
2343,2.07133512293 
2344,2.1223946408 
2345,2.32904715074 
2346,2.15108485466 
2347,2.09735138572 
2348,2.39045483366 
2349,1.99102495305 
2350,2.0494459384 
2351,2.00570542973 
2352,2.08479954379 
2353,2.04842674317 
2354,2.00803030355 
2355,2.59673381012 
2356,1.99612647719 
2357,2.11562624952 
2358,2.51604396976 
2359,2.16279533451 
2360,1.97706670869 
2361,2.14483263961 
2362,2.10131244171 
2363,2.08767600328 
2364,2.44332526881 
2365,2.27192273202 
2366,2.49706489324 
2367,2.22583761854 
2368,2.09846526319 
2369,1.99696056125 
2370,2.47505206083 
2371,2.05009652147 
2372,2.17975374269 
2373,2.4577846045 
2374,2.00359136715 
2375,2.18227203101 
2376,2.20003974327 
2377,2.48929046144 
2378,1.99358539596 
2379,2.24290066967 
2380,2.01911184649 
2381,2.02107232279 
2382,2.0475602621 
2383,2.27879474531 
2384,2.18508974262 
2385,2.36526095312 
2386,2.0889043474 
2387,2.09789513176 
2388,2.61152757204 
2389,2.39250477784 
2390,2.10858629071 
2391,2.10122422413 
2392,2.14823873461 
2393,2.0678137839 
2394,2.23602379661 
2395,2.1033927156 
