$ mmax-model-selection mmax-model-selection/etc/combined_PHM.csv mmax-model-selection/etc/mmax_obs.csv --prior mmax-model-selection/etc/combined_precessing_prior_source-frame-masses.csv --mass-column mass_2_source --mmax-column Mmax > mmax-model-selection/combinedphm_combinedprecessingprior_obsmmax.out

Mmax POSTERIOR:
	num=20000
	mean=2.222864e+00
	std=2.146169e-01
	min=1.970001e+00
	max=2.899960e+00
MASS POSTERIOR:
	num=27736
	mean=2.587310e+00
	median=2.588220e+00
	std=5.302449e-02
	min=2.300970e+00
	max=2.838526e+00
MASS PRIOR:
	num=10000
	mean=1.855258e+01
	median=1.654329e+01
	std=1.148841e+01
	min=1.686580e+00
	max=5.557759e+01
    posterior probability: P(m<=Mmax|data) = 1.037933e-01 +/- 4.245073e-06 +/- 2.037448e-03
    prior probability:          P(m<=Mmax) = 6.744240e-03 +/- 5.773160e-06 +/- 2.037448e-03
    Bayes^{belowMmax}_{everything} = 5.015077e+00 +/- 7.065135e-03 +/- 9.623884e-02
    Bayes^{aboveMmax}_{everything} = 9.007928e-01 +/- 6.403965e-06 +/- 2.045039e-03
    Bayes^{aboveMmax}_{belowMmax} = 1.796169e-01 +/- 2.530437e-04 +/- 3.470868e-03
    Bayes^{belowMmax}_{aboveMmax} = 5.567404e+00 +/- 7.843340e-03 +/- 1.075830e-01
