accommodate 'tasc-ref' to be used for the reference-epoch for orbital tp used...

accommodate 'tasc-ref' to be used for the reference-epoch for orbital tp used for computing the phase-metric

- incorporate changes to accommodate 'tasc-ref' to be used for the reference-epoch for orbital tp
used for computing the phase-metric in the Weave search-code for the Binary case only

- added a checking condition that asserts the 'tasc-ref' value being within the interval of at most 1 orbital period away from the tasc-range (this should be fine for long-segment limit)

- modified two scripts for running 'SingleSegment' and 'MultipleSegment' tests

- ran some basic tests to ensure that there is no obvious new problem for finding the injected signal
24 jobs for weave-binary-Arunava-new in 14 minutes and 6 seconds (queued for 4 seconds)
Status Job ID Name Coverage
  Level0
passed #116229
level0:el7:lal

00:04:55

passed #116228
level0:stretch:lal

00:02:53

 
  Level1
passed #116234
level1:el7:lalframe

00:01:58

passed #116235
level1:el7:lalmetaio

00:01:41

passed #116236
level1:el7:lalsimulation

00:03:31

passed #116237
level1:el7:lalxml

00:01:29

passed #116230
level1:stretch:lalframe

00:01:48

passed #116231
level1:stretch:lalmetaio

00:01:22

passed #116232
level1:stretch:lalsimulation

00:02:50

passed #116233
level1:stretch:lalxml

00:01:24

 
  Level2
passed #116242
level2:el7:lalburst

00:02:16

passed #116243
level2:el7:lalinspiral

00:05:37

failed #116244
level2:el7:lalpulsar

00:03:26

passed #116245
level2:el7:lalstochastic

00:02:07

passed #116238
level2:stretch:lalburst

00:02:06

passed #116239
level2:stretch:lalinspiral

00:04:24

failed #116240
level2:stretch:lalpulsar

00:03:33

passed #116241
level2:stretch:lalstochastic

00:01:43

 
  Level3
skipped #116248
level3:el7:laldetchar
skipped #116249
level3:el7:lalinference
skipped #116246
level3:stretch:laldetchar
skipped #116247
level3:stretch:lalinference
 
  Level4
skipped #116251
level4:el7:lalapps
skipped #116250
level4:stretch:lalapps
 
Name Stage Failure
failed
level2:stretch:lalpulsar Level2
Makefile:1727: recipe for target 'check-am' failed
make[2]: Leaving directory '/builds/reinhard-prix/lalsuite/lalpulsar-1.16.0.1/subdir/test'
make[2]: *** [check-am] Error 2
make[1]: *** [check-recursive] Error 1
Makefile:616: recipe for target 'check-recursive' failed
make[1]: Leaving directory '/builds/reinhard-prix/lalsuite/lalpulsar-1.16.0.1/subdir'
make: *** [check] Error 2
Makefile:904: recipe for target 'check' failed
ERROR: Job failed: exit code 1
failed
level2:el7:lalpulsar Level2
make[3]: *** [LatticeTilingTest.o] Error 1
make[3]: *** Waiting for unfinished jobs....
make[3]: Leaving directory `/builds/reinhard-prix/lalsuite/lalpulsar-1.16.0.1/subdir/test'
make[2]: *** [check-am] Error 2
make[2]: Leaving directory `/builds/reinhard-prix/lalsuite/lalpulsar-1.16.0.1/subdir/test'
make[1]: *** [check-recursive] Error 1
make[1]: Leaving directory `/builds/reinhard-prix/lalsuite/lalpulsar-1.16.0.1/subdir'
make: *** [check] Error 2
ERROR: Job failed: exit code 1