{
    "outdir": "wf_bench_out/",
    "domain": "TD",
    "use_FD": false,
    "Total_mass_MSUN": 5.0,
    "Sampling_rate_Hz": 32768.0,
    "f_min": 100.0,
    "iota": 0.0,
    "distance_MPC": 1.0,
    "random" : false,
    "verbose": false,
    "approximant": "SEOBNRv4T",
    "cfgfile": "cfgs.dat"
}

