1.000000000000000000e+02 0.000000000000000000e+00
1.099099099099099135e+02 1.050635212576733152e-07
1.198198198198198270e+02 1.020519523520156606e-07
1.297297297297297405e+02 1.005889668547569587e-07
1.396396396396396540e+02 1.003520366137283454e-07
1.495495495495495675e+02 1.011297951127967079e-07
1.594594594594594525e+02 1.027827496529594256e-07
1.693693693693693660e+02 1.052196348766114910e-07
1.792792792792792795e+02 1.083826994150832864e-07
1.891891891891891930e+02 1.122382903191813858e-07
1.990990990990991065e+02 1.167706848195313085e-07
2.090090090090089916e+02 1.219779717036288493e-07
2.189189189189189051e+02 1.278692607387613134e-07
2.288288288288288186e+02 1.344627732919956842e-07
2.387387387387387321e+02 1.417845305015276632e-07
2.486486486486486456e+02 1.498674548761271331e-07
2.585585585585585591e+02 1.587507633344577128e-07
2.684684684684684726e+02 1.684795693225402024e-07
2.783783783783783861e+02 1.791046374101994959e-07
2.882882882882882996e+02 1.906822508105185679e-07
2.981981981981982130e+02 2.032741637195794563e-07
3.081081081081081265e+02 2.169476181795175776e-07
3.180180180180179832e+02 2.317754105543424337e-07
3.279279279279279535e+02 2.478359964651894973e-07
3.378378378378378102e+02 2.652136256760770266e-07
3.477477477477477805e+02 2.839985002955675018e-07
3.576576576576576372e+02 3.042869509944646243e-07
3.675675675675675507e+02 3.261816268922387734e-07
3.774774774774774642e+02 3.497916954437166925e-07
3.873873873873873777e+02 3.752330491389108637e-07
3.972972972972972912e+02 4.026285161663651220e-07
4.072072072072072046e+02 4.321080724228127119e-07
4.171171171171171181e+02 4.638090524072797232e-07
4.270270270270270316e+02 4.978763566367745131e-07
4.369369369369369451e+02 5.344626532788238420e-07
4.468468468468468586e+02 5.737285717251820638e-07
4.567567567567567721e+02 6.158428858401380170e-07
4.666666666666666856e+02 6.609826846132379592e-07
4.765765765765765991e+02 7.093335279356759996e-07
4.864864864864865126e+02 7.610895852069859717e-07
4.963963963963964261e+02 8.164537544678935827e-07
5.063063063063062827e+02 8.756377597498343233e-07
5.162162162162162531e+02 9.388622243346823035e-07
5.261261261261261097e+02 1.006356717632305247e-06
5.360360360360359664e+02 1.078359773411144710e-06
5.459459459459459367e+02 1.155118877160137017e-06
5.558558558558559071e+02 1.236890420420996281e-06
5.657657657657657637e+02 1.323939620009753670e-06
5.756756756756756204e+02 1.416540400147133566e-06
5.855855855855855907e+02 1.514975235640086655e-06
5.954954954954955610e+02 1.619534954402652221e-06
6.054054054054054177e+02 1.730518497774276061e-06
6.153153153153152743e+02 1.848232637288256599e-06
6.252252252252252447e+02 1.972991646762618043e-06
6.351351351351351013e+02 2.105116928830415398e-06
6.450450450450450717e+02 2.244936595296138991e-06
6.549549549549549283e+02 2.392785000999020299e-06
6.648648648648648987e+02 2.549002231181676511e-06
6.747747747747747553e+02 2.713933542702789471e-06
6.846846846846847257e+02 2.887928759793601842e-06
6.945945945945945823e+02 3.071341625438206398e-06
7.045045045045045526e+02 3.264529109854964426e-06
7.144144144144144093e+02 3.467850677967564029e-06
7.243243243243243796e+02 3.681667518177581260e-06
7.342342342342342363e+02 3.906341735181101221e-06
7.441441441441440929e+02 4.142235510008119000e-06
7.540540540540540633e+02 4.389710230899456377e-06
7.639639639639639199e+02 4.649125599069280827e-06
7.738738738738738903e+02 4.920838713826052471e-06
7.837837837837837469e+02 5.205203141937420689e-06
7.936936936936937173e+02 5.502567976519558504e-06
8.036036036036035739e+02 5.813276891104141031e-06
8.135135135135135442e+02 6.137667194881353789e-06
8.234234234234234009e+02 6.476068895430054783e-06
8.333333333333333712e+02 6.828803775521048491e-06
8.432432432432432279e+02 7.196184490811977731e-06
8.531531531531531982e+02 7.578513695437012006e-06
8.630630630630630549e+02 7.976083202627372328e-06
8.729729729729730252e+02 8.389173187574914625e-06
8.828828828828828819e+02 8.818051439766826587e-06
8.927927927927928522e+02 9.262972671971180603e-06
9.027027027027027088e+02 9.724177892937814401e-06
9.126126126126125655e+02 1.020189385069375644e-05
9.225225225225225358e+02 1.069633255305608566e-05
9.324324324324323925e+02 1.120769087165516886e-05
9.423423423423423628e+02 1.173615023535897804e-05
9.522522522522522195e+02 1.228187641851239723e-05
9.621621621621621898e+02 1.284501942885819050e-05
9.720720720720720465e+02 1.342571349938696107e-05
9.819819819819820168e+02 1.402407718767838832e-05
9.918918918918918735e+02 1.464021358554549903e-05
1.001801801801801844e+03 1.527421064098457063e-05
1.011711711711711700e+03 1.592614159356959861e-05
1.021621621621621671e+03 1.659606552351814508e-05
1.031531531531531527e+03 1.728402801370266455e-05
1.041441441441441384e+03 1.799006192289404039e-05
1.051351351351351241e+03 1.871418826751264404e-05
1.061261261261261097e+03 1.945641720813293455e-05
1.071171171171171181e+03 2.021674913595279259e-05
1.081081081081081038e+03 2.099517585340568106e-05
1.090990990990991122e+03 2.179168184207481426e-05
1.100900900900900979e+03 2.260624561007200769e-05
1.110810810810810835e+03 2.343884111008352782e-05
1.120720720720720692e+03 2.428943921836711136e-05
1.130630630630630549e+03 2.515800926412418867e-05
1.140540540540540633e+03 2.604452059787439329e-05
1.150450450450450489e+03 2.694894418673953558e-05
1.160360360360360346e+03 2.787125422390751442e-05
1.170270270270270203e+03 2.881142973900468194e-05
1.180180180180180287e+03 2.976945619566273359e-05
1.190090090090090143e+03 3.074532706223382039e-05
1.200000000000000000e+03 3.173904534138859813e-05
1.209909909909909857e+03 3.275062504423181608e-05
1.219819819819819713e+03 3.378009259459521807e-05
1.229729729729729797e+03 3.482748814931586109e-05
1.239639639639639654e+03 3.589286682058610888e-05
1.249549549549549511e+03 3.697629978686603974e-05
1.259459459459459367e+03 3.807787527937868123e-05
1.269369369369369451e+03 3.919769943186284124e-05
1.279279279279279308e+03 4.033589698203230307e-05
1.289189189189189165e+03 4.149261181407686027e-05
1.299099099099099021e+03 4.266800733253589691e-05
1.309009009009009105e+03 4.386226665896984268e-05
1.318918918918918962e+03 4.507559264404109215e-05
1.328828828828828819e+03 4.630820768888236591e-05
1.338738738738738675e+03 4.756035337096537488e-05
1.348648648648648759e+03 4.883228987108072076e-05
1.358558558558558616e+03 5.012429519947685894e-05
1.368468468468468473e+03 5.143666422068323649e-05
1.378378378378378329e+03 5.276970747803275054e-05
1.388288288288288186e+03 5.412374982040138324e-05
1.398198198198198270e+03 5.549912883517241436e-05
1.408108108108108127e+03 5.689619309290587371e-05
1.418018018018017983e+03 5.831530021062921696e-05
1.427927927927927840e+03 5.975681474205626637e-05
1.437837837837837924e+03 6.122110590437176796e-05
1.447747747747747781e+03 6.270854515247797955e-05
1.457657657657657637e+03 6.421950361277770395e-05
1.467567567567567494e+03 6.575434938965466695e-05
1.477477477477477578e+03 6.731344475879677840e-05
1.487387387387387435e+03 6.889714326238544930e-05
1.497297297297297291e+03 7.050578672193719251e-05
1.507207207207207148e+03 7.213970218522559581e-05
1.517117117117117232e+03 7.379919882423140068e-05
1.527027027027027088e+03 7.548456480146038643e-05
1.536936936936936945e+03 7.719606412223372466e-05
1.546846846846846802e+03 7.893393349069266127e-05
1.556756756756756658e+03 8.069837918726964249e-05
1.566666666666666742e+03 8.248957398526670824e-05
1.576576576576576599e+03 8.430765412394490143e-05
1.586486486486486456e+03 8.615271635518644412e-05
1.596396396396396312e+03 8.802481508032572574e-05
1.606306306306306396e+03 8.992395959319118913e-05
1.616216216216216253e+03 9.185011144473773906e-05
1.626126126126126110e+03 9.380318194391053612e-05
1.636036036036035966e+03 9.578302980855383315e-05
1.645945945945946050e+03 9.778945897928884229e-05
1.655855855855855907e+03 9.982221660832708051e-05
1.665765765765765764e+03 1.018809912341874841e-04
1.675675675675675620e+03 1.039654111522303969e-04
1.685585585585585704e+03 1.060750429898498290e-04
1.695495495495495561e+03 1.082093904940558532e-04
1.705405405405405418e+03 1.103678935380690383e-04
1.715315315315315274e+03 1.125499273524169534e-04
1.725225225225225131e+03 1.147548019849061981e-04
1.735135135135135215e+03 1.169817619927290164e-04
1.745045045045045072e+03 1.192299863688647257e-04
1.754954954954954928e+03 1.214985887038632538e-04
1.764864864864864785e+03 1.237866175830468467e-04
1.774774774774774869e+03 1.260930572181546397e-04
1.784684684684684726e+03 1.284168283114706945e-04
1.794594594594594582e+03 1.307567891495418487e-04
1.804504504504504439e+03 1.331117369226878769e-04
1.814414414414414523e+03 1.354804092656618035e-04
1.824324324324324380e+03 1.378614860140056793e-04
1.834234234234234236e+03 1.402535911698942199e-04
1.844144144144144093e+03 1.426552950705413467e-04
1.854054054054053950e+03 1.450651167515905945e-04
1.863963963963964034e+03 1.474815264972878038e-04
1.873873873873873890e+03 1.499029485686732778e-04
1.883783783783783747e+03 1.523277641005055315e-04
1.893693693693693604e+03 1.547543141571585963e-04
1.903603603603603688e+03 1.571809029373009200e-04
1.913513513513513544e+03 1.596058011167799566e-04
1.923423423423423401e+03 1.620272493187918206e-04
1.933333333333333258e+03 1.644434617001141053e-04
1.943243243243243342e+03 1.668526296419155588e-04
1.953153153153153198e+03 1.692529255334380555e-04
1.963063063063063055e+03 1.716425066366569785e-04
1.972972972972972912e+03 1.740195190198858281e-04
1.982882882882882996e+03 1.763821015481765715e-04
1.992792792792792852e+03 1.787283899183000544e-04
2.002702702702702709e+03 1.810565207260501658e-04
2.012612612612612565e+03 1.833646355536197299e-04
2.022522522522522422e+03 1.856508850648284329e-04
2.032432432432432506e+03 1.879134330960569304e-04
2.042342342342342363e+03 1.901504607308430583e-04
2.052252252252252219e+03 1.923601703462437379e-04
2.062162162162162076e+03 1.945407896192337318e-04
2.072072072072071933e+03 1.966905754816287294e-04
2.081981981981982244e+03 1.988078180122571429e-04
2.091891891891891646e+03 2.008908442553847685e-04
2.101801801801801957e+03 2.029380219547029490e-04
2.111711711711711814e+03 2.049477631925232589e-04
2.121621621621621671e+03 2.069185279241977926e-04
2.131531531531531527e+03 2.088488273981702721e-04
2.141441441441441384e+03 2.107372274524869243e-04
2.151351351351351241e+03 2.125823516790408473e-04
2.161261261261261097e+03 2.143828844472852344e-04
2.171171171171170954e+03 2.161375737796385286e-04
2.181081081081081265e+03 2.178452340713027445e-04
2.190990990990991122e+03 2.195047486477291277e-04
2.200900900900900979e+03 2.211150721534924362e-04
2.210810810810810835e+03 2.226752327668626201e-04
2.220720720720720692e+03 2.241843342349025792e-04
2.230630630630630549e+03 2.256415577244548661e-04
2.240540540540540405e+03 2.270461634849190509e-04
2.250450450450450262e+03 2.283974923192526687e-04
2.260360360360360573e+03 2.296949668601529074e-04
2.270270270270270430e+03 2.309380926488936335e-04
2.280180180180180287e+03 2.321264590147997006e-04
2.290090090090090143e+03 2.332597397538284899e-04
2.300000000000000000e+03 2.343376936052125610e-04
2.309909909909909857e+03 2.353601645255760477e-04
2.319819819819819713e+03 2.363270817603906830e-04
2.329729729729729570e+03 2.372384597130642681e-04
2.339639639639639427e+03 2.380943976123769707e-04
2.349549549549549738e+03 2.388950789793789541e-04
2.359459459459459595e+03 2.396407708952550503e-04
2.369369369369369451e+03 2.403318230720397910e-04
2.379279279279279308e+03 2.409686667284306175e-04
2.389189189189189165e+03 2.415518132733115476e-04
2.399099099099099021e+03 2.420818527999517788e-04
2.409009009009008878e+03 2.425594523941962887e-04
2.418918918918918735e+03 2.429853542603205470e-04
2.428828828828829046e+03 2.433603736685737860e-04
2.438738738738738903e+03 2.436853967288027183e-04
2.448648648648648759e+03 2.439613779949126912e-04
2.458558558558558616e+03 2.441893379053106821e-04
2.468468468468468473e+03 2.443703600648686474e-04
2.478378378378378329e+03 2.445055883743538000e-04
2.488288288288288186e+03 2.445962240137089776e-04
2.498198198198198043e+03 2.446435222860038426e-04
2.508108108108107899e+03 2.446487893293465467e-04
2.518018018018018211e+03 2.446133787045304871e-04
2.527927927927928067e+03 2.445386878666841674e-04
2.537837837837837924e+03 2.444261545297135227e-04
2.547747747747747781e+03 2.442772529328517930e-04
2.557657657657657637e+03 2.440934900191695238e-04
2.567567567567567494e+03 2.438764015364436831e-04
2.577477477477477350e+03 2.436275480713294265e-04
2.587387387387387207e+03 2.433485110283201125e-04
2.597297297297297519e+03 2.430408885655125956e-04
2.607207207207207375e+03 2.427062914997132057e-04
2.617117117117117232e+03 2.423463391939085295e-04
2.627027027027027088e+03 2.419626554405880062e-04
2.636936936936936945e+03 2.415568643548312829e-04
2.646846846846846802e+03 2.411305862914425767e-04
2.656756756756756658e+03 2.406854338007438383e-04
2.666666666666666515e+03 2.402230076378906662e-04
2.676576576576576372e+03 2.397448928407667470e-04
2.686486486486486683e+03 2.392526548916232092e-04
2.696396396396396540e+03 2.387478359776510186e-04
2.706306306306306396e+03 2.382319513656110631e-04
2.716216216216216253e+03 2.377064859054817754e-04
2.726126126126126110e+03 2.371728906778171298e-04
2.736036036036035966e+03 2.366325797991349934e-04
2.745945945945945823e+03 2.360869273991758079e-04
2.755855855855855680e+03 2.355372647832752124e-04
2.765765765765765991e+03 2.349848777923948813e-04
2.775675675675675848e+03 2.344310043725347293e-04
2.785585585585585704e+03 2.338768323643313992e-04
2.795495495495495561e+03 2.333234975226163824e-04
2.805405405405405418e+03 2.327720817745778997e-04
2.815315315315315274e+03 2.322236117239508341e-04
2.825225225225225131e+03 2.316790574073455218e-04
2.835135135135134988e+03 2.311393313074429031e-04
2.845045045045044844e+03 2.306052876263282642e-04
2.854954954954955156e+03 2.300777218207225236e-04
2.864864864864865012e+03 2.295573703993202355e-04
2.874774774774774869e+03 2.290449109808504586e-04
2.884684684684684726e+03 2.285409626098775274e-04
2.894594594594594582e+03 2.280460863257494780e-04
2.904504504504504439e+03 2.275607859785035234e-04
2.914414414414414296e+03 2.270855092839703002e-04
2.924324324324324152e+03 2.266206491087864106e-04
2.934234234234234464e+03 2.261665449745515458e-04
2.944144144144144320e+03 2.257234847689614573e-04
2.954054054054054177e+03 2.252917066504270521e-04
2.963963963963964034e+03 2.248714011314653877e-04
2.973873873873873890e+03 2.244627133250337320e-04
2.983783783783783747e+03 2.240657453369823357e-04
2.993693693693693604e+03 2.236805587869356135e-04
3.003603603603603460e+03 2.233071774391885407e-04
3.013513513513513317e+03 2.229455899246224446e-04
3.023423423423423628e+03 2.225957525342188242e-04
3.033333333333333485e+03 2.222575920644789425e-04
3.043243243243243342e+03 2.219310086949456966e-04
3.053153153153153198e+03 2.216158788780699150e-04
3.063063063063063055e+03 2.213120582218770923e-04
3.072972972972972912e+03 2.210193843462478138e-04
3.082882882882882768e+03 2.207376796941502850e-04
3.092792792792792625e+03 2.204667542798246073e-04
3.102702702702702936e+03 2.202064083567264975e-04
3.112612612612612793e+03 2.199564349889777731e-04
3.122522522522522650e+03 2.197166225111304614e-04
3.132432432432432506e+03 2.194867568622257980e-04
3.142342342342342363e+03 2.192666237814028577e-04
3.152252252252252219e+03 2.190560108536725051e-04
3.162162162162162076e+03 2.188547093959057220e-04
3.172072072072071933e+03 2.186625161745819467e-04
3.181981981981981789e+03 2.184792349483834955e-04
3.191891891891892101e+03 2.183046778302931716e-04
3.201801801801801957e+03 2.181386664654421780e-04
3.211711711711711814e+03 2.179810330225446450e-04
3.221621621621621671e+03 2.178316209983375868e-04
3.231531531531531527e+03 2.176902858359918498e-04
3.241441441441441384e+03 2.175568953599815931e-04
3.251351351351351241e+03 2.174313300313541596e-04
3.261261261261261097e+03 2.173134830287463796e-04
3.271171171171171409e+03 2.172032601618134389e-04
3.281081081081081265e+03 2.171005796249768588e-04
3.290990990990991122e+03 2.170053716005420990e-04
3.300900900900900979e+03 2.169175777212797613e-04
3.310810810810810835e+03 2.168371504034964853e-04
3.320720720720720692e+03 2.167640520624428038e-04
3.330630630630630549e+03 2.166982542226030700e-04
3.340540540540540405e+03 2.166397365359877688e-04
3.350450450450450262e+03 2.165884857220039933e-04
3.360360360360360573e+03 2.165444944427969733e-04
3.370270270270270430e+03 2.165077601281588274e-04
3.380180180180180287e+03 2.164782837641672302e-04
3.390090090090090143e+03 2.164560686596641518e-04
3.400000000000000000e+03 2.164411192045089991e-04
3.409909909909909857e+03 2.164334396332466971e-04
3.419819819819819713e+03 2.164330328074207403e-04
3.429729729729729570e+03 2.164398990292499907e-04
3.439639639639639427e+03 2.164540348987623855e-04
3.449549549549549738e+03 2.164754322257681602e-04
3.459459459459459595e+03 2.165040770072499277e-04
3.469369369369369451e+03 2.165399484798595617e-04
3.479279279279279308e+03 2.165830182562557835e-04
3.489189189189189165e+03 2.166332495529939219e-04
3.499099099099099021e+03 2.166905965165992866e-04
3.509009009009008878e+03 2.167550036533356711e-04
3.518918918918918735e+03 2.168264053670168232e-04
3.528828828828829046e+03 2.169047256080267028e-04
3.538738738738738903e+03 2.169898776355100073e-04
3.548648648648648759e+03 2.170817638934868679e-04
3.558558558558558616e+03 2.171802760004421776e-04
3.568468468468468473e+03 2.172852948507515117e-04
3.578378378378378329e+03 2.173966908251390271e-04
3.588288288288288186e+03 2.175143241062358322e-04
3.598198198198198043e+03 2.176380450942207623e-04
3.608108108108107899e+03 2.177676949164943608e-04
3.618018018018018211e+03 2.179031060243739632e-04
3.627927927927928067e+03 2.180441028688984053e-04
3.637837837837837924e+03 2.181905026470236906e-04
3.647747747747747781e+03 2.183421161087637213e-04
3.657657657657657637e+03 2.184987484152045058e-04
3.667567567567567494e+03 2.186602000367975616e-04
3.677477477477477350e+03 2.188262676809202712e-04
3.687387387387387207e+03 2.189967452373925232e-04
3.697297297297297519e+03 2.191714247304537351e-04
3.707207207207207375e+03 2.193500972656406021e-04
3.717117117117117232e+03 2.195325539600677975e-04
3.727027027027027088e+03 2.197185868447931235e-04
3.736936936936936945e+03 2.199079897282567688e-04
3.746846846846846802e+03 2.201005590102063532e-04
3.756756756756756658e+03 2.202960944360681298e-04
3.766666666666666515e+03 2.204943997823764811e-04
3.776576576576576372e+03 2.206952834646429805e-04
3.786486486486486683e+03 2.208985590599090690e-04
3.796396396396396540e+03 2.211040457371874098e-04
3.806306306306306396e+03 2.213115685900396033e-04
3.816216216216216253e+03 2.215209588666514778e-04
3.826126126126126110e+03 2.217320540939471331e-04
3.836036036036035966e+03 2.219446980935108288e-04
3.845945945945945823e+03 2.221587408883470341e-04
3.855855855855855680e+03 2.223740385007989665e-04
3.865765765765765991e+03 2.225904526432383971e-04
3.875675675675675848e+03 2.228078503044305411e-04
3.885585585585585704e+03 2.230261032357451229e-04
3.895495495495495561e+03 2.232450873426167085e-04
3.905405405405405418e+03 2.234646819878385036e-04
3.915315315315315274e+03 2.236847692143929551e-04
3.925225225225225131e+03 2.239052328965566053e-04
3.935135135135134988e+03 2.241259578289677649e-04
3.945045045045044844e+03 2.243468287641826842e-04
3.954954954954955156e+03 2.245677294099787127e-04
3.964864864864865012e+03 2.247885413982618778e-04
3.974774774774774869e+03 2.250091432379080797e-04
3.984684684684684726e+03 2.252294092641954717e-04
3.994594594594594582e+03 2.254492085976706199e-04
4.004504504504504439e+03 2.256684041253255110e-04
4.014414414414414296e+03 2.258868515168478762e-04
4.024324324324324152e+03 2.261043982884404524e-04
4.034234234234234464e+03 2.263208829262907968e-04
4.044144144144144320e+03 2.265361340812146107e-04
4.054054054054054177e+03 2.267499698452949959e-04
4.063963963963964034e+03 2.269621971205116587e-04
4.073873873873873890e+03 2.271726110884026578e-04
4.083783783783783747e+03 2.273809947887326527e-04
4.093693693693693604e+03 2.275871188139840841e-04
4.103603603603603915e+03 2.277907411252308055e-04
4.113513513513513317e+03 2.279916069936390604e-04
4.123423423423423628e+03 2.281894490704601325e-04
4.133333333333333940e+03 2.283839875869634868e-04
4.143243243243243342e+03 2.285749306843216531e-04
4.153153153153152743e+03 2.287619748720166771e-04
4.163063063063063055e+03 2.289448056119016469e-04
4.172972972972973366e+03 2.291230980236574097e-04
4.182882882882882768e+03 2.292965177060237564e-04
4.192792792792792170e+03 2.294647216668961609e-04
4.202702702702702481e+03 2.296273593541660687e-04
4.212612612612612793e+03 2.297840737780617248e-04
4.222522522522522195e+03 2.299345027147335814e-04
4.232432432432432506e+03 2.300782799799353016e-04
4.242342342342341908e+03 2.302150367608807205e-04
4.252252252252252219e+03 2.303444029937341158e-04
4.262162162162162531e+03 2.304660087737025749e-04
4.272072072072071933e+03 2.305794857843704825e-04
4.281981981981982244e+03 2.306844687327306513e-04
4.291891891891891646e+03 2.307805967763452829e-04
4.301801801801801957e+03 2.308675149291960409e-04
4.311711711711711359e+03 2.309448754330633788e-04
4.321621621621621671e+03 2.310123390817016851e-04
4.331531531531531982e+03 2.310695764856467692e-04
4.341441441441441384e+03 2.311162692661923655e-04
4.351351351351351695e+03 2.311521111678972739e-04
4.361261261261261097e+03 2.311768090799261950e-04
4.371171171171171409e+03 2.311900839575611053e-04
4.381081081081080811e+03 2.311916716363508404e-04
4.390990990990991122e+03 2.311813235325651129e-04
4.400900900900900524e+03 2.311588072248742904e-04
4.410810810810810835e+03 2.311239069134818022e-04
4.420720720720721147e+03 2.310764237542605847e-04
4.430630630630630549e+03 2.310161760667854309e-04
4.440540540540540860e+03 2.309429994164883008e-04
4.450450450450450262e+03 2.308567465724794155e-04
4.460360360360360573e+03 2.307572873438550900e-04
4.470270270270269975e+03 2.306445082985486604e-04
4.480180180180180287e+03 2.305183123699462385e-04
4.490090090090089689e+03 2.303786183575867014e-04
4.500000000000000000e+03 2.302253603292729015e-04
4.509909909909910311e+03 2.300584869328339236e-04
4.519819819819819713e+03 2.298779606265881445e-04
4.529729729729730025e+03 2.296837568382537466e-04
4.539639639639639427e+03 2.294758630626328975e-04
4.549549549549549738e+03 2.292542779088567321e-04
4.559459459459459140e+03 2.290190101083112257e-04
4.569369369369369451e+03 2.287700774945769381e-04
4.579279279279278853e+03 2.285075059668003575e-04
4.589189189189189165e+03 2.282313284478781792e-04
4.599099099099099476e+03 2.279415838486813478e-04
4.609009009009008878e+03 2.276383160492733728e-04
4.618918918918919189e+03 2.273215729077006104e-04
4.628828828828828591e+03 2.269914053064478097e-04
4.638738738738738903e+03 2.266478662460785440e-04
4.648648648648648305e+03 2.262910099949164535e-04
4.658558558558558616e+03 2.259208913028845037e-04
4.668468468468468927e+03 2.255375646868151493e-04
4.678378378378378329e+03 2.251410837936803733e-04
4.688288288288288641e+03 2.247315008472810887e-04
4.698198198198198043e+03 2.243088661829934080e-04
4.708108108108108354e+03 2.238732278741956171e-04
4.718018018018017756e+03 2.234246314530179741e-04
4.727927927927928067e+03 2.229631197270658398e-04
4.737837837837837469e+03 2.224887326927825189e-04
4.747747747747747781e+03 2.220015075451484512e-04
4.757657657657658092e+03 2.215014787824655027e-04
4.767567567567567494e+03 2.209886784040599578e-04
4.777477477477477805e+03 2.204631361978602881e-04
4.787387387387387207e+03 2.199248801139754364e-04
4.797297297297297519e+03 2.193739367196191365e-04
4.807207207207206920e+03 2.188103317300038998e-04
4.817117117117117232e+03 2.182340906091657169e-04
4.827027027027026634e+03 2.176452392340890352e-04
4.836936936936936945e+03 2.170438046149686081e-04
4.846846846846847257e+03 2.164298156639934577e-04
4.856756756756756658e+03 2.158033040046511582e-04
4.866666666666666970e+03 2.151643048132376407e-04
4.876576576576576372e+03 2.145128576840248308e-04
4.886486486486486683e+03 2.138490075093666689e-04
4.896396396396396085e+03 2.131728053659371323e-04
4.906306306306306396e+03 2.124843093982668068e-04
4.916216216216215798e+03 2.117835856907958043e-04
4.926126126126126110e+03 2.110707091197698451e-04
4.936036036036036421e+03 2.103457641764890887e-04
4.945945945945945823e+03 2.096088457536556297e-04
4.955855855855856134e+03 2.088600598868639439e-04
4.965765765765765536e+03 2.080995244436350589e-04
4.975675675675675848e+03 2.073273697527947229e-04
4.985585585585585250e+03 2.065437391674548688e-04
4.995495495495495561e+03 2.057487895553508509e-04
5.005405405405405872e+03 2.049426917108276445e-04
5.015315315315315274e+03 2.041256306833420190e-04
5.025225225225225586e+03 2.032978060179542457e-04
5.035135135135134988e+03 2.024594319039218278e-04
5.045045045045045299e+03 2.016107372281625396e-04
5.054954954954954701e+03 2.007519655310418540e-04
5.064864864864865012e+03 1.998833748626290127e-04
5.074774774774774414e+03 1.990052375382803964e-04
5.084684684684684726e+03 1.981178397931196618e-04
5.094594594594595037e+03 1.972214813357087051e-04
5.104504504504504439e+03 1.963164748019151059e-04
5.114414414414414750e+03 1.954031451106997142e-04
5.124324324324324152e+03 1.944818287242490115e-04
5.134234234234234464e+03 1.935528728155636860e-04
5.144144144144143866e+03 1.926166343472908958e-04
5.154054054054054177e+03 1.916734790662294550e-04
5.163963963963963579e+03 1.907237804185665049e-04
5.173873873873873890e+03 1.897679183914881848e-04
5.183783783783784202e+03 1.888062782873720633e-04
5.193693693693693604e+03 1.878392494372817581e-04
5.203603603603603915e+03 1.868672238609655296e-04
5.213513513513513317e+03 1.858905948809955622e-04
5.223423423423423628e+03 1.849097556990645784e-04
5.233333333333333030e+03 1.839250979427981979e-04
5.243243243243243342e+03 1.829370101917186309e-04
5.253153153153152743e+03 1.819458764912248755e-04
5.263063063063063055e+03 1.809520748636245886e-04
5.272972972972973366e+03 1.799559758253658863e-04
5.282882882882882768e+03 1.789579409196684204e-04
5.292792792792793080e+03 1.779583212737500684e-04
5.302702702702702481e+03 1.769574561897783018e-04
5.312612612612612793e+03 1.759556717785486603e-04
5.322522522522522195e+03 1.749532796447127582e-04
5.332432432432432506e+03 1.739505756321331324e-04
5.342342342342341908e+03 1.729478386376484306e-04
5.352252252252252219e+03 1.719453295011785744e-04
5.362162162162162531e+03 1.709432899797016614e-04
5.372072072072071933e+03 1.699419418121772150e-04
5.381981981981982244e+03 1.689414858819988680e-04
5.391891891891891646e+03 1.679421014830173825e-04
5.401801801801801957e+03 1.669439456945956488e-04
5.411711711711711359e+03 1.659471528705479552e-04
5.421621621621621671e+03 1.649518342461642694e-04
5.431531531531531982e+03 1.639580776668569050e-04
5.441441441441441384e+03 1.629659474412633788e-04
5.451351351351351695e+03 1.619754843209333679e-04
5.461261261261261097e+03 1.609867056079964634e-04
5.471171171171171409e+03 1.599996053914686965e-04
5.481081081081080811e+03 1.590141549121171704e-04
5.490990990990991122e+03 1.580303030550515701e-04
5.500900900900900524e+03 1.570479769684743571e-04
5.510810810810810835e+03 1.560670828062815207e-04
5.520720720720721147e+03 1.550875065914851926e-04
5.530630630630630549e+03 1.541091151967139143e-04
5.540540540540540860e+03 1.531317574373576617e-04
5.550450450450450262e+03 1.521552652722519552e-04
5.560360360360360573e+03 1.511794551061470062e-04
5.570270270270269975e+03 1.502041291875926715e-04
5.580180180180180287e+03 1.492290770952777433e-04
5.590090090090089689e+03 1.482540773053133624e-04
5.600000000000000000e+03 1.472788988314256925e-04
5.609909909909910311e+03 1.463033029295524804e-04
5.619819819819819713e+03 1.453270448578946336e-04
5.629729729729730025e+03 1.443498756830838216e-04
5.639639639639639427e+03 1.433715441227817911e-04
5.649549549549549738e+03 1.423917984147244026e-04
5.659459459459459140e+03 1.414103882019803707e-04
5.669369369369369451e+03 1.404270664239936814e-04
5.679279279279278853e+03 1.394415912028426716e-04
5.689189189189189165e+03 1.384537277140557331e-04
5.699099099099099476e+03 1.374632500313020811e-04
5.709009009009008878e+03 1.364699429342986056e-04
5.718918918918919189e+03 1.354736036693676628e-04
5.728828828828828591e+03 1.344740436522300921e-04
5.738738738738738903e+03 1.334710901028242868e-04
5.748648648648648305e+03 1.324645876022226547e-04
5.758558558558558616e+03 1.314543995620434235e-04
5.768468468468468927e+03 1.304404095971582517e-04
5.778378378378378329e+03 1.294225227929503101e-04
5.788288288288288641e+03 1.284006668588960425e-04
5.798198198198198043e+03 1.273747931608219645e-04
5.808108108108108354e+03 1.263448776248186521e-04
5.818018018018017756e+03 1.253109215064852184e-04
5.827927927927928067e+03 1.242729520199167630e-04
5.837837837837837469e+03 1.232310228216377407e-04
5.847747747747747781e+03 1.221852143455161321e-04
5.857657657657658092e+03 1.211356339855723717e-04
5.867567567567567494e+03 1.200824161245034327e-04
5.877477477477477805e+03 1.190257220066863101e-04
5.887387387387387207e+03 1.179657394553927912e-04
5.897297297297297519e+03 1.169026824349275105e-04
5.907207207207206920e+03 1.158367904594040344e-04
5.917117117117117232e+03 1.147683278508686148e-04
5.927027027027026634e+03 1.136975828504868202e-04
5.936936936936936945e+03 1.126248665874906749e-04
5.946846846846847257e+03 1.115505119115618878e-04
5.956756756756756658e+03 1.104748720952647775e-04
5.966666666666666970e+03 1.093983194140602904e-04
5.976576576576576372e+03 1.083212436122986232e-04
5.986486486486486683e+03 1.072440502644105725e-04
5.996396396396396085e+03 1.061671590412815433e-04
6.006306306306306396e+03 1.050910018924896378e-04
6.016216216216215798e+03 1.040160211557230625e-04
6.026126126126126110e+03 1.029426676052379422e-04
6.036036036036036421e+03 1.018713984516907237e-04
6.045945945945945823e+03 1.008026753060584839e-04
6.055855855855856134e+03 9.973696212064703628e-05
6.065765765765765536e+03 9.867472312038220149e-05
6.075675675675675848e+03 9.761642073766738439e-05
6.085585585585585250e+03 9.656251356408766080e-05
6.095495495495495561e+03 9.551345433212579997e-05
6.105405405405405872e+03 9.446968793984830931e-05
6.115315315315315274e+03 9.343164953120178045e-05
6.125225225225225586e+03 9.239976264415073338e-05
6.135135135135134988e+03 9.137443743837899996e-05
6.145045045045045299e+03 9.035606901367342482e-05
6.154954954954954701e+03 8.934503582942325594e-05
6.164864864864865012e+03 8.834169823489229504e-05
6.174774774774774414e+03 8.734639711907952336e-05
6.184684684684684726e+03 8.635945268806157415e-05
6.194594594594595037e+03 8.538116337673930321e-05
6.204504504504504439e+03 8.441180490087708485e-05
6.214414414414414750e+03 8.345162945425262102e-05
6.224324324324324152e+03 8.250086505462924671e-05
6.234234234234234464e+03 8.155971504112755478e-05
6.244144144144143866e+03 8.062835772443251528e-05
6.254054054054054177e+03 7.970694619011836103e-05
6.263963963963963579e+03 7.879560825423261939e-05
6.273873873873873890e+03 7.789444656914850502e-05
6.283783783783784202e+03 7.700353887659741885e-05
6.293693693693693604e+03 7.612293840372085950e-05
6.303603603603603915e+03 7.525267439695983000e-05
6.313513513513513317e+03 7.439275278763251111e-05
6.323423423423423628e+03 7.354315698213490275e-05
6.333333333333333030e+03 7.270384876886645451e-05
6.343243243243243342e+03 7.187476933321029337e-05
6.353153153153152743e+03 7.105584037121813294e-05
6.363063063063063055e+03 7.024696529204844692e-05
6.372972972972973366e+03 6.944803049870179319e-05
6.382882882882882768e+03 6.865890673618010962e-05
6.392792792792793080e+03 6.787945049588166562e-05
6.402702702702702481e+03 6.710950546482198663e-05
6.412612612612612793e+03 6.634890400814897390e-05
6.422522522522522195e+03 6.559746867339761949e-05
6.432432432432432506e+03 6.485501370499875315e-05
6.442342342342342818e+03 6.412134655772643650e-05
6.452252252252252219e+03 6.339626939802214735e-05
6.462162162162162531e+03 6.267958058247921529e-05
6.472072072072071933e+03 6.197107610320024592e-05
6.481981981981982244e+03 6.127055099023852986e-05
6.491891891891891646e+03 6.057780066191576819e-05
6.501801801801801957e+03 5.989262221444208102e-05
6.511711711711711359e+03 5.921481564296580551e-05
6.521621621621621671e+03 5.854418498692486055e-05
6.531531531531531982e+03 5.788053939336371606e-05
6.541441441441441384e+03 5.722369409270170072e-05
6.551351351351351695e+03 5.657347128229132461e-05
6.561261261261261097e+03 5.592970091397329787e-05
6.571171171171171409e+03 5.529222138271376125e-05
6.581081081081080811e+03 5.466088011429212309e-05
6.590990990990991122e+03 5.403553405088048405e-05
6.600900900900900524e+03 5.341605003422153540e-05
6.610810810810810835e+03 5.280230508694928182e-05
6.620720720720721147e+03 5.219418659341395339e-05
6.630630630630630549e+03 5.159159238215050219e-05
6.640540540540540860e+03 5.099443071286987705e-05
6.650450450450450262e+03 5.040262017154807059e-05
6.660360360360360573e+03 4.981608947782908904e-05
6.670270270270269975e+03 4.923477720955025440e-05
6.680180180180180287e+03 4.865863144972731874e-05
6.690090090090089689e+03 4.808760936180843761e-05
6.700000000000000000e+03 4.752167669941059888e-05
6.709909909909910311e+03 4.696080725709654796e-05
6.719819819819819713e+03 4.640498226902272370e-05
6.729729729729730025e+03 4.585418976249910190e-05
6.739639639639639427e+03 4.530842387364646259e-05
6.749549549549549738e+03 4.476768413241073605e-05
6.759459459459459140e+03 4.423197472421254808e-05
6.769369369369369451e+03 4.370130373545912068e-05
6.779279279279278853e+03 4.317568239004186513e-05
6.789189189189189165e+03 4.265512428377872078e-05
6.799099099099099476e+03 4.213964462354635943e-05
6.809009009009008878e+03 4.162925947758209795e-05
6.818918918918919189e+03 4.112398504312729942e-05
6.828828828828828591e+03 4.062383693723446910e-05
6.838738738738738903e+03 4.012882951617445168e-05
6.848648648648648305e+03 3.963897522846474475e-05
6.858558558558558616e+03 3.915428400609515598e-05
6.868468468468468927e+03 3.867476269806490417e-05
6.878378378378378329e+03 3.820041454986171663e-05
6.888288288288288641e+03 3.773123873202123427e-05
6.898198198198198043e+03 3.726722992040575386e-05
6.908108108108108354e+03 3.680837793033492616e-05
6.918018018018017756e+03 3.635466740620310237e-05
6.927927927927928067e+03 3.590607756771894255e-05
6.937837837837837469e+03 3.546258201341874239e-05
6.947747747747747781e+03 3.502414858163050142e-05
6.957657657657658092e+03 3.459073926861067560e-05
6.967567567567567494e+03 3.416231020313657699e-05
6.977477477477477805e+03 3.373881167642468201e-05
6.987387387387387207e+03 3.332018822585356343e-05
6.997297297297297519e+03 3.290637877060651330e-05
7.007207207207206920e+03 3.249731679701431863e-05
7.017117117117117232e+03 3.209293059107046756e-05
7.027027027027026634e+03 3.169314351531777652e-05
7.036936936936936945e+03 3.129787432705818392e-05
7.046846846846847257e+03 3.090703753462594112e-05
7.056756756756756658e+03 3.052054378828123556e-05
7.066666666666666970e+03 3.013830030213084750e-05
7.076576576576576372e+03 2.976021130336290208e-05
7.086486486486486683e+03 2.938617850499108182e-05
7.096396396396396085e+03 2.901610159824455533e-05
7.106306306306306396e+03 2.864987876070532936e-05
7.116216216216215798e+03 2.828740717628985910e-05
7.126126126126126110e+03 2.792858356318948161e-05
7.136036036036036421e+03 2.757330470592943522e-05
7.145945945945945823e+03 2.722146798777020217e-05
7.155855855855856134e+03 2.687297191976238336e-05
7.165765765765765536e+03 2.652771666287320607e-05
7.175675675675675848e+03 2.618560453972410487e-05
7.185585585585585250e+03 2.584654053262154755e-05
7.195495495495495561e+03 2.551043276471477849e-05
7.205405405405405872e+03 2.517719296128376143e-05
7.215315315315315274e+03 2.484673688833770487e-05
7.225225225225225586e+03 2.451898476589447855e-05
7.235135135135134988e+03 2.419386165350855377e-05
7.245045045045045299e+03 2.387129780581961536e-05
7.254954954954954701e+03 2.355122899610632007e-05
7.264864864864865012e+03 2.323359680604491080e-05
7.274774774774774414e+03 2.291834888009433224e-05
7.284684684684684726e+03 2.260543914315126042e-05
7.294594594594595037e+03 2.229482798034619490e-05
7.304504504504504439e+03 2.198648237807745325e-05
7.314414414414414750e+03 2.168037602560785005e-05
7.324324324324324152e+03 2.137648937677758961e-05
7.334234234234234464e+03 2.107480967161121923e-05
7.344144144144143866e+03 2.077533091782394218e-05
7.354054054054054177e+03 2.047805383245339714e-05
7.363963963963963579e+03 2.018298574406421917e-05
7.373873873873873890e+03 1.989014045618816472e-05
7.383783783783784202e+03 1.959953807287551460e-05
7.393693693693693604e+03 1.931120478743975449e-05
7.403603603603603915e+03 1.902517263567982814e-05
7.413513513513513317e+03 1.874147921505996711e-05
7.423423423423423628e+03 1.846016737151363760e-05
7.433333333333333030e+03 1.818128485572125672e-05
7.443243243243243342e+03 1.790488395088028989e-05
7.453153153153152743e+03 1.763102107415087547e-05
7.463063063063063055e+03 1.735975635411037948e-05
7.472972972972973366e+03 1.709115318669184651e-05
7.482882882882882768e+03 1.682527777220931616e-05
7.492792792792793080e+03 1.656219863618825914e-05
7.502702702702702481e+03 1.630198613682117350e-05
7.512612612612612793e+03 1.604471196195394499e-05
7.522522522522522195e+03 1.579044861858024511e-05
7.532432432432432506e+03 1.553926891787456939e-05
7.542342342342342818e+03 1.529124545883193349e-05
7.552252252252252219e+03 1.504645011360037149e-05
7.562162162162162531e+03 1.480495351759290397e-05
7.572072072072071933e+03 1.456682456744708505e-05
7.581981981981982244e+03 1.433212992986023904e-05
7.591891891891891646e+03 1.410093356427247287e-05
7.601801801801801957e+03 1.387329626228913131e-05
7.611711711711711359e+03 1.364927520663829859e-05
7.621621621621621671e+03 1.342892355233990264e-05
7.631531531531531982e+03 1.321229003262724141e-05
7.641441441441441384e+03 1.299941859200560662e-05
7.651351351351351695e+03 1.279034804865937447e-05
7.661261261261261097e+03 1.258511178822891911e-05
7.671171171171171409e+03 1.238373749077162241e-05
7.681081081081080811e+03 1.218624689250113323e-05
7.690990990990991122e+03 1.199265558366436594e-05
7.700900900900900524e+03 1.180297284367097224e-05
7.710810810810810835e+03 1.161720151433374762e-05
7.720720720720721147e+03 1.143533791181675110e-05
7.730630630630630549e+03 1.125737177761821843e-05
7.740540540540540860e+03 1.108328626864345450e-05
7.750450450450450262e+03 1.091305798614986853e-05
7.760360360360360573e+03 1.074665704307274582e-05
7.770270270270269975e+03 1.058404716897207768e-05
7.780180180180180287e+03 1.042518585157649334e-05
7.790090090090089689e+03 1.027002451364519285e-05
7.800000000000000000e+03 1.011850872362303018e-05
7.809909909909910311e+03 9.970578438331592026e-06
7.819819819819819713e+03 9.826168275720115487e-06
7.829729729729730025e+03 9.685207815499016025e-06
7.839639639639639427e+03 9.547621925295407492e-06
7.849549549549549738e+03 9.413331109806268029e-06
7.859459459459459140e+03 9.282251880284369272e-06
7.869369369369369451e+03 9.154297141572080408e-06
7.879279279279278853e+03 9.029376593804370023e-06
7.889189189189189165e+03 8.907397145831211815e-06
7.899099099099099476e+03 8.788263337365146251e-06
7.909009009009008878e+03 8.671877766839916133e-06
7.918918918918919189e+03 8.558141521972014790e-06
7.928828828828828591e+03 8.446954610048366499e-06
7.938738738738738903e+03 8.338216385018905449e-06
7.948648648648648305e+03 8.231825968552903164e-06
7.958558558558558616e+03 8.127682662320510616e-06
7.968468468468468927e+03 8.025686348885500217e-06
7.978378378378378329e+03 7.925737878739564540e-06
7.988288288288288641e+03 7.827739441171802697e-06
7.998198198198198043e+03 7.731594916846918169e-06
8.008108108108108354e+03 7.637210210159541086e-06
8.018018018018017756e+03 7.544493559639839762e-06
8.027927927927928067e+03 7.453355824901937965e-06
8.037837837837837469e+03 7.363710748852602116e-06
8.047747747747747781e+03 7.275475194107868441e-06
8.057657657657658092e+03 7.188569352799804805e-06
8.067567567567567494e+03 7.102916929190236932e-06
8.077477477477477805e+03 7.018445294741907463e-06
8.087387387387387207e+03 6.935085615527504921e-06
8.097297297297297519e+03 6.852772952080709521e-06
8.107207207207206920e+03 6.771446332009936561e-06
8.117117117117117232e+03 6.691048795901577687e-06
8.127027027027026634e+03 6.611527417234749217e-06
8.136936936936936945e+03 6.532833297211095357e-06
8.146846846846847257e+03 6.454921535571107414e-06
8.156756756756756658e+03 6.377751178619978866e-06
8.166666666666666970e+03 6.301285145821495675e-06
8.176576576576576372e+03 6.225490136436867142e-06
8.186486486486486683e+03 6.150336517785244031e-06
8.196396396396396085e+03 6.075798196785403827e-06
8.206306306306305487e+03 6.001852476501816260e-06
8.216216216216216708e+03 5.928479899464364746e-06
8.226126126126126110e+03 5.855664079559423266e-06
8.236036036036035512e+03 5.783391524300313557e-06
8.245945945945946733e+03 5.711651449280155562e-06
8.255855855855856134e+03 5.640435586587980994e-06
8.265765765765765536e+03 5.569737988932581962e-06
8.275675675675676757e+03 5.499554831168559540e-06
8.285585585585584340e+03 5.429884210855767967e-06
8.295495495495495561e+03 5.360725949408723238e-06
8.305405405405404963e+03 5.292081395308780007e-06
8.315315315315316184e+03 5.223953230757275665e-06
8.325225225225225586e+03 5.156345283048269993e-06
8.335135135135134988e+03 5.089262341831603607e-06
8.345045045045044390e+03 5.022709983326112449e-06
8.354954954954955610e+03 4.956694402427233397e-06
8.364864864864865012e+03 4.891222253536423431e-06
8.374774774774774414e+03 4.826300500821402973e-06
8.384684684684683816e+03 4.761936278498665853e-06
8.394594594594595037e+03 4.698136761612861171e-06
8.404504504504504439e+03 4.634909047673569679e-06
8.414414414414413841e+03 4.572260049398559985e-06
8.424324324324325062e+03 4.510196398706078502e-06
8.434234234234234464e+03 4.448724361995746554e-06
8.444144144144143866e+03 4.387849766660793323e-06
8.454054054054053267e+03 4.327577938683269385e-06
8.463963963963964488e+03 4.267913651078502916e-06
8.473873873873873890e+03 4.208861082877004061e-06
8.483783783783783292e+03 4.150423788260095443e-06
8.493693693693694513e+03 4.092604675401283253e-06
8.503603603603603915e+03 4.035405994507787651e-06
8.513513513513513317e+03 3.978829334506064731e-06
8.523423423423422719e+03 3.922875627772394050e-06
8.533333333333333940e+03 3.867545162272908039e-06
8.543243243243243342e+03 3.812837600448390196e-06
8.553153153153152743e+03 3.758752004156353257e-06
8.563063063063063964e+03 3.705286864967054247e-06
8.572972972972973366e+03 3.652440139100107842e-06
8.582882882882882768e+03 3.600209286284576256e-06
8.592792792792792170e+03 3.548591311827658053e-06
8.602702702702703391e+03 3.497582811184439931e-06
8.612612612612612793e+03 3.447180016333996248e-06
8.622522522522522195e+03 3.397378843284616924e-06
8.632432432432431597e+03 3.348174940053556752e-06
8.642342342342342818e+03 3.299563734492809783e-06
8.652252252252252219e+03 3.251540481363447341e-06
8.662162162162161621e+03 3.204100308094820478e-06
8.672072072072072842e+03 3.157238258703060746e-06
8.681981981981982244e+03 3.110949335383595457e-06
8.691891891891891646e+03 3.065228537335878599e-06
8.701801801801801048e+03 3.020070896424465559e-06
8.711711711711712269e+03 2.975471509328243077e-06
8.721621621621621671e+03 2.931425565879245495e-06
8.731531531531531073e+03 2.887928373343261611e-06
8.741441441441442294e+03 2.844975376446630213e-06
8.751351351351351695e+03 2.802562173005804258e-06
8.761261261261261097e+03 2.760684525069173553e-06
8.771171171171170499e+03 2.719338365533383948e-06
8.781081081081081720e+03 2.678519800248200660e-06
8.790990990990991122e+03 2.638225105675396873e-06
8.800900900900900524e+03 2.598450722216681989e-06
8.810810810810811745e+03 2.559193243374028726e-06
8.820720720720721147e+03 2.520449400951589094e-06
8.830630630630630549e+03 2.482216046551677752e-06
8.840540540540539951e+03 2.444490129658129498e-06
8.850450450450451171e+03 2.407268672637320807e-06
8.860360360360360573e+03 2.370548743020949561e-06
8.870270270270269975e+03 2.334327423464271770e-06
8.880180180180179377e+03 2.298601779799179500e-06
8.890090090090090598e+03 2.263368827622291711e-06
8.900000000000000000e+03 2.228625497874766701e-06
8.909909909909909402e+03 2.194368601881748628e-06
8.919819819819820623e+03 2.160594796326047419e-06
8.929729729729730025e+03 2.127300548631803808e-06
8.939639639639639427e+03 2.094482103230009260e-06
8.949549549549548829e+03 2.062135449169069758e-06
8.959459459459460049e+03 2.030256289519334966e-06
8.969369369369369451e+03 1.998840013001780481e-06
8.979279279279278853e+03 1.967881668247247890e-06
8.989189189189190074e+03 1.937375941064649096e-06
8.999099099099099476e+03 1.907317135063999419e-06
9.009009009009008878e+03 1.877699155943904973e-06
9.018918918918918280e+03 1.848515499713463226e-06
9.028828828828829501e+03 1.819759245075585407e-06
9.038738738738738903e+03 1.791423050153378274e-06
9.048648648648648305e+03 1.763499153693529752e-06
9.058558558558557706e+03 1.735979380831746688e-06
9.068468468468468927e+03 1.708855153454804928e-06
9.078378378378378329e+03 1.682117505143397840e-06
9.088288288288287731e+03 1.655757100629128759e-06
9.098198198198198952e+03 1.629764259649329629e-06
9.108108108108108354e+03 1.604128985034543303e-06
9.118018018018017756e+03 1.578840994816580711e-06
9.127927927927927158e+03 1.553889758100589578e-06
9.137837837837838379e+03 1.529264534402624200e-06
9.147747747747747781e+03 1.504954416115768881e-06
9.157657657657657182e+03 1.480948373732930314e-06
9.167567567567568403e+03 1.457235303423876727e-06
9.177477477477477805e+03 1.433804076537603662e-06
9.187387387387387207e+03 1.410643590579621294e-06
9.197297297297296609e+03 1.387742821197166056e-06
9.207207207207207830e+03 1.365090874693701982e-06
9.217117117117117232e+03 1.342677040587890217e-06
9.227027027027026634e+03 1.320490843731043883e-06
9.236936936936937855e+03 1.298522095501422686e-06
9.246846846846847257e+03 1.276760943603039057e-06
9.256756756756756658e+03 1.255197920010977271e-06
9.266666666666666060e+03 1.233823986624638015e-06
9.276576576576577281e+03 1.212630578213978104e-06
9.286486486486486683e+03 1.191609642271966807e-06
9.296396396396396085e+03 1.170753675418452555e-06
9.306306306306305487e+03 1.150055756036217673e-06
9.316216216216216708e+03 1.129509572858520345e-06
9.326126126126126110e+03 1.109109449268725408e-06
9.336036036036035512e+03 1.088850363115919323e-06
9.345945945945946733e+03 1.068727961895458592e-06
9.355855855855856134e+03 1.048738573189454871e-06
9.365765765765765536e+03 1.028879210308750476e-06
9.375675675675674938e+03 1.009147573124783932e-06
9.385585585585586159e+03 9.895420441257895362e-07
9.395495495495495561e+03 9.700616797770420274e-07
9.405405405405404963e+03 9.507061973085229529e-07
9.415315315315316184e+03 9.314759570952102341e-07
9.425225225225225586e+03 9.123719408345018422e-07
9.435135135135134988e+03 8.933957257618385288e-07
9.445045045045044390e+03 8.745494551791699025e-07
9.454954954954955610e+03 8.558358056006965975e-07
9.464864864864865012e+03 8.372579508467498754e-07
9.474774774774774414e+03 8.188195234387743820e-07
9.484684684684683816e+03 8.005245736667522443e-07
9.494594594594595037e+03 7.823775267141305338e-07
9.504504504504504439e+03 7.643831382351264669e-07
9.514414414414413841e+03 7.465464487843895708e-07
9.524324324324325062e+03 7.288727375002203000e-07
9.534234234234234464e+03 7.113674754392422184e-07
9.544144144144143866e+03 6.940362789531643071e-07
9.554054054054053267e+03 6.768848634873649390e-07
9.563963963963964488e+03 6.599189981660067190e-07
9.573873873873873890e+03 6.431444615104454101e-07
9.583783783783783292e+03 6.265669986163416126e-07
9.593693693693694513e+03 6.101922800908871105e-07
9.603603603603603915e+03 5.940258630251754678e-07
9.613513513513513317e+03 5.780731542480543864e-07
9.623423423423422719e+03 5.623393760779172948e-07
9.633333333333333940e+03 5.468295347571301249e-07
9.643243243243243342e+03 5.315483917216683704e-07
9.653153153153152743e+03 5.165004378256082511e-07
9.663063063063063964e+03 5.016898706072017020e-07
9.672972972972973366e+03 4.871205746506990229e-07
9.682882882882882768e+03 4.727961050659173788e-07
9.692792792792792170e+03 4.587196740767417172e-07
9.702702702702703391e+03 4.448941406799328202e-07
9.712612612612612793e+03 4.313220033075146632e-07
9.722522522522522195e+03 4.180053953998701659e-07
9.732432432432431597e+03 4.049460837725039097e-07
9.742342342342342818e+03 3.921454696376199354e-07
9.752252252252252219e+03 3.796045921223916741e-07
9.762162162162161621e+03 3.673241341088843885e-07
9.772072072072072842e+03 3.553044302067699418e-07
9.781981981981982244e+03 3.435454766584041392e-07
9.791891891891891646e+03 3.320469429674331585e-07
9.801801801801801048e+03 3.208081850361913414e-07
9.811711711711712269e+03 3.098282595940099121e-07
9.821621621621621671e+03 2.991059396980771962e-07
9.831531531531531073e+03 2.886397310903014938e-07
9.841441441441442294e+03 2.784278891981366280e-07
9.851351351351351695e+03 2.684684365736315823e-07
9.861261261261261097e+03 2.587591805735576257e-07
9.871171171171170499e+03 2.492977310938171743e-07
9.881081081081081720e+03 2.400815181831132408e-07
9.890990990990991122e+03 2.311078093742306995e-07
9.900900900900900524e+03 2.223737265856188484e-07
9.910810810810811745e+03 2.138762624612545969e-07
9.920720720720721147e+03 2.056122960327596512e-07
9.930630630630630549e+03 1.975786076040048239e-07
9.940540540540539951e+03 1.897718927751583558e-07
9.950450450450451171e+03 1.821887755395162019e-07
9.960360360360360573e+03 1.748258204028732902e-07
9.970270270270269975e+03 1.676795434910253568e-07
9.980180180180179377e+03 1.607464226262723891e-07
9.990090090090090598e+03 1.540229063683338441e-07
1.000000000000000000e+04 1.475054220286427816e-07
