09:54 bilby INFO    : Running for label 'dynesty', output will be saved to '../run5'
09:54 bilby INFO    : Search parameters:
09:54 bilby INFO    :   gamma = Uniform(minimum=0.0, maximum=12.0, name='gamma', latex_label='gamma', unit=None, boundary=None)
09:54 bilby INFO    :   kappa = Uniform(minimum=0.0, maximum=6.0, name='kappa', latex_label='kappa', unit=None, boundary=None)
09:54 bilby INFO    :   zp = Uniform(minimum=0.0, maximum=4.0, name='zp', latex_label='zp', unit=None, boundary=None)
09:54 bilby INFO    :   R0 = Uniform(minimum=0, maximum=100, name='R0', latex_label='R0', unit=None, boundary=None)
09:54 bilby INFO    :   alpha = Uniform(minimum=-4, maximum=12, name='alpha', latex_label='alpha', unit=None, boundary=None)
09:54 bilby INFO    :   beta = Uniform(minimum=-4, maximum=12, name='beta', latex_label='beta', unit=None, boundary=None)
09:54 bilby INFO    :   mmax = Uniform(minimum=50, maximum=200, name='mmax', latex_label='mmax', unit=None, boundary=None)
09:54 bilby INFO    :   mmin = Uniform(minimum=2, maximum=10, name='mmin', latex_label='mmin', unit=None, boundary=None)
09:54 bilby INFO    :   mu_g = Uniform(minimum=20, maximum=50, name='mu_g', latex_label='mu_g', unit=None, boundary=None)
09:54 bilby INFO    :   sigma_g = Uniform(minimum=0.4, maximum=10, name='sigma_g', latex_label='sigma_g', unit=None, boundary=None)
09:54 bilby INFO    :   lambda_peak = Uniform(minimum=0, maximum=1, name='lambda_peak', latex_label='lambda_peak', unit=None, boundary=None)
09:54 bilby INFO    :   delta_m = Uniform(minimum=0, maximum=10, name='delta_m', latex_label='delta_m', unit=None, boundary=None)
09:54 bilby INFO    :   H0 = 67.9
09:54 bilby INFO    :   Om0 = 0.3065
/home/simone.mastrogiovanni/.conda/envs/icarogw/lib/python3.9/site-packages/icarogw-0.0.1-py3.9.egg/icarogw/priors/custom_math_priors.py:48: RuntimeWarning: overflow encountered in exp
/home/simone.mastrogiovanni/.conda/envs/icarogw/lib/python3.9/site-packages/icarogw-0.0.1-py3.9.egg/icarogw/priors/custom_math_priors.py:161: RuntimeWarning: divide by zero encountered in log
/home/simone.mastrogiovanni/.conda/envs/icarogw/lib/python3.9/site-packages/icarogw-0.0.1-py3.9.egg/icarogw/priors/custom_math_priors.py:159: RuntimeWarning: divide by zero encountered in log
/home/simone.mastrogiovanni/.conda/envs/icarogw/lib/python3.9/site-packages/icarogw-0.0.1-py3.9.egg/icarogw/cosmologies.py:107: RuntimeWarning: divide by zero encountered in log10
/home/simone.mastrogiovanni/.conda/envs/icarogw/lib/python3.9/site-packages/icarogw-0.0.1-py3.9.egg/icarogw/priors/redshift.py:65: RuntimeWarning: divide by zero encountered in log
/home/simone.mastrogiovanni/.conda/envs/icarogw/lib/python3.9/site-packages/icarogw-0.0.1-py3.9.egg/icarogw/priors/custom_math_priors.py:183: RuntimeWarning: divide by zero encountered in log
/home/simone.mastrogiovanni/.conda/envs/icarogw/lib/python3.9/site-packages/icarogw-0.0.1-py3.9.egg/icarogw/priors/custom_math_priors.py:183: RuntimeWarning: invalid value encountered in log
/home/simone.mastrogiovanni/.conda/envs/icarogw/lib/python3.9/site-packages/icarogw-0.0.1-py3.9.egg/icarogw/priors/custom_math_priors.py:183: RuntimeWarning: invalid value encountered in subtract
/home/simone.mastrogiovanni/.conda/envs/icarogw/lib/python3.9/site-packages/icarogw-0.0.1-py3.9.egg/icarogw/analyses/cosmo_pop_rate_marginalized.py:183: RuntimeWarning: invalid value encountered in subtract
09:54 bilby INFO    : Single likelihood evaluation took 1.074e-01 s
09:54 bilby INFO    : Using sampler Dynesty with kwargs {'bound': 'multi', 'sample': 'rwalk', 'verbose': True, 'periodic': None, 'reflective': None, 'check_point_delta_t': 600, 'nlive': 1000, 'first_update': None, 'walks': 100, 'npdim': None, 'rstate': None, 'queue_size': 16, 'pool': None, 'use_pool': None, 'live_points': None, 'logl_args': None, 'logl_kwargs': None, 'ptform_args': None, 'ptform_kwargs': None, 'enlarge': 1.5, 'bootstrap': None, 'vol_dec': 0.5, 'vol_check': 8.0, 'facc': 0.2, 'slices': 5, 'update_interval': 600, 'print_func': <bound method Dynesty._print_func of <bilby.core.sampler.dynesty.Dynesty object at 0x2b2ed0e87d30>>, 'dlogz': 0.1, 'maxiter': None, 'maxcall': None, 'logl_max': inf, 'add_live': True, 'print_progress': True, 'save_bounds': False, 'n_effective': None, 'maxmcmc': 5000, 'nact': 5}
09:54 bilby INFO    : Checkpoint every check_point_delta_t = 600s
09:54 bilby INFO    : Using dynesty version 1.0.1
09:54 bilby INFO    : Using the bilby-implemented rwalk sample method with ACT estimated walks
09:54 bilby INFO    : Setting up multiproccesing pool with 16 processes.
09:54 bilby INFO    : Resume file ../run5/dynesty_resume.pickle does not exist.
09:54 bilby INFO    : Generating initial points from the prior
/home/simone.mastrogiovanni/.conda/envs/icarogw/lib/python3.9/site-packages/icarogw-0.0.1-py3.9.egg/icarogw/priors/custom_math_priors.py:48: RuntimeWarning: divide by zero encountered in true_divide
