09:45 bilby INFO    : Running for label 'dynesty', output will be saved to '../run1'
09:45 bilby INFO    : Search parameters:
09:45 bilby INFO    :   gamma = Uniform(minimum=0.0, maximum=12.0, name='gamma', latex_label='gamma', unit=None, boundary=None)
09:45 bilby INFO    :   kappa = Uniform(minimum=0.0, maximum=6.0, name='kappa', latex_label='kappa', unit=None, boundary=None)
09:45 bilby INFO    :   zp = Uniform(minimum=0.0, maximum=4.0, name='zp', latex_label='zp', unit=None, boundary=None)
09:45 bilby INFO    :   R0 = Uniform(minimum=0, maximum=100, name='R0', latex_label='R0', unit=None, boundary=None)
09:45 bilby INFO    :   alpha = Uniform(minimum=-4, maximum=12, name='alpha', latex_label='alpha', unit=None, boundary=None)
09:45 bilby INFO    :   beta = Uniform(minimum=-4, maximum=12, name='beta', latex_label='beta', unit=None, boundary=None)
09:45 bilby INFO    :   mmax = Uniform(minimum=50, maximum=200, name='mmax', latex_label='mmax', unit=None, boundary=None)
09:45 bilby INFO    :   mmin = Uniform(minimum=2, maximum=10, name='mmin', latex_label='mmin', unit=None, boundary=None)
09:45 bilby INFO    :   mu_g = Uniform(minimum=20, maximum=50, name='mu_g', latex_label='mu_g', unit=None, boundary=None)
09:45 bilby INFO    :   sigma_g = Uniform(minimum=0.4, maximum=10, name='sigma_g', latex_label='sigma_g', unit=None, boundary=None)
09:45 bilby INFO    :   lambda_peak = Uniform(minimum=0, maximum=1, name='lambda_peak', latex_label='lambda_peak', unit=None, boundary=None)
09:45 bilby INFO    :   delta_m = Uniform(minimum=0, maximum=10, name='delta_m', latex_label='delta_m', unit=None, boundary=None)
09:45 bilby INFO    :   H0 = 67.9
09:45 bilby INFO    :   Om0 = 0.3065
/home/simone.mastrogiovanni/.conda/envs/icarogw/lib/python3.9/site-packages/icarogw-0.0.1-py3.9.egg/icarogw/priors/custom_math_priors.py:48: RuntimeWarning: overflow encountered in exp
/home/simone.mastrogiovanni/.conda/envs/icarogw/lib/python3.9/site-packages/icarogw-0.0.1-py3.9.egg/icarogw/priors/custom_math_priors.py:161: RuntimeWarning: divide by zero encountered in log
/home/simone.mastrogiovanni/.conda/envs/icarogw/lib/python3.9/site-packages/icarogw-0.0.1-py3.9.egg/icarogw/priors/custom_math_priors.py:159: RuntimeWarning: divide by zero encountered in log
/home/simone.mastrogiovanni/.conda/envs/icarogw/lib/python3.9/site-packages/icarogw-0.0.1-py3.9.egg/icarogw/cosmologies.py:107: RuntimeWarning: divide by zero encountered in log10
/home/simone.mastrogiovanni/.conda/envs/icarogw/lib/python3.9/site-packages/icarogw-0.0.1-py3.9.egg/icarogw/priors/redshift.py:65: RuntimeWarning: divide by zero encountered in log
/home/simone.mastrogiovanni/.conda/envs/icarogw/lib/python3.9/site-packages/icarogw-0.0.1-py3.9.egg/icarogw/priors/custom_math_priors.py:183: RuntimeWarning: divide by zero encountered in log
/home/simone.mastrogiovanni/.conda/envs/icarogw/lib/python3.9/site-packages/icarogw-0.0.1-py3.9.egg/icarogw/priors/custom_math_priors.py:183: RuntimeWarning: invalid value encountered in log
/home/simone.mastrogiovanni/.conda/envs/icarogw/lib/python3.9/site-packages/icarogw-0.0.1-py3.9.egg/icarogw/priors/custom_math_priors.py:183: RuntimeWarning: invalid value encountered in subtract
/home/simone.mastrogiovanni/.conda/envs/icarogw/lib/python3.9/site-packages/icarogw-0.0.1-py3.9.egg/icarogw/analyses/cosmo_pop_rate_marginalized.py:183: RuntimeWarning: invalid value encountered in subtract
09:46 bilby INFO    : Single likelihood evaluation took 2.040e-01 s
09:46 bilby INFO    : Using sampler Dynesty with kwargs {'bound': 'multi', 'sample': 'rwalk', 'verbose': True, 'periodic': None, 'reflective': None, 'check_point_delta_t': 600, 'nlive': 1000, 'first_update': None, 'walks': 100, 'npdim': None, 'rstate': None, 'queue_size': 16, 'pool': None, 'use_pool': None, 'live_points': None, 'logl_args': None, 'logl_kwargs': None, 'ptform_args': None, 'ptform_kwargs': None, 'enlarge': 1.5, 'bootstrap': None, 'vol_dec': 0.5, 'vol_check': 8.0, 'facc': 0.2, 'slices': 5, 'update_interval': 600, 'print_func': <bound method Dynesty._print_func of <bilby.core.sampler.dynesty.Dynesty object at 0x2b1ce23e4700>>, 'dlogz': 0.1, 'maxiter': None, 'maxcall': None, 'logl_max': inf, 'add_live': True, 'print_progress': True, 'save_bounds': False, 'n_effective': None, 'maxmcmc': 5000, 'nact': 5}
09:46 bilby INFO    : Checkpoint every check_point_delta_t = 600s
09:46 bilby INFO    : Using dynesty version 1.0.1
09:46 bilby INFO    : Using the bilby-implemented rwalk sample method with ACT estimated walks
09:46 bilby INFO    : Setting up multiproccesing pool with 16 processes.
09:46 bilby INFO    : Resume file ../run1/dynesty_resume.pickle does not exist.
09:46 bilby INFO    : Generating initial points from the prior
/home/simone.mastrogiovanni/.conda/envs/icarogw/lib/python3.9/site-packages/icarogw-0.0.1-py3.9.egg/icarogw/priors/custom_math_priors.py:48: RuntimeWarning: divide by zero encountered in true_divide
/home/simone.mastrogiovanni/.conda/envs/icarogw/lib/python3.9/site-packages/icarogw-0.0.1-py3.9.egg/icarogw/priors/custom_math_priors.py:48: RuntimeWarning: divide by zero encountered in true_divide
/home/simone.mastrogiovanni/.conda/envs/icarogw/lib/python3.9/site-packages/icarogw-0.0.1-py3.9.egg/icarogw/priors/custom_math_priors.py:48: RuntimeWarning: divide by zero encountered in true_divide
/home/simone.mastrogiovanni/.conda/envs/icarogw/lib/python3.9/site-packages/icarogw-0.0.1-py3.9.egg/icarogw/priors/custom_math_priors.py:48: RuntimeWarning: divide by zero encountered in true_divide
/home/simone.mastrogiovanni/.conda/envs/icarogw/lib/python3.9/site-packages/icarogw-0.0.1-py3.9.egg/icarogw/priors/custom_math_priors.py:48: RuntimeWarning: divide by zero encountered in true_divide
/home/simone.mastrogiovanni/.conda/envs/icarogw/lib/python3.9/site-packages/icarogw-0.0.1-py3.9.egg/icarogw/priors/custom_math_priors.py:48: RuntimeWarning: divide by zero encountered in true_divide
/home/simone.mastrogiovanni/.conda/envs/icarogw/lib/python3.9/site-packages/icarogw-0.0.1-py3.9.egg/icarogw/priors/custom_math_priors.py:48: RuntimeWarning: divide by zero encountered in true_divide
/home/simone.mastrogiovanni/.conda/envs/icarogw/lib/python3.9/site-packages/icarogw-0.0.1-py3.9.egg/icarogw/priors/custom_math_priors.py:48: RuntimeWarning: divide by zero encountered in true_divide
/home/simone.mastrogiovanni/.conda/envs/icarogw/lib/python3.9/site-packages/icarogw-0.0.1-py3.9.egg/icarogw/priors/custom_math_priors.py:48: RuntimeWarning: divide by zero encountered in true_divide
/home/simone.mastrogiovanni/.conda/envs/icarogw/lib/python3.9/site-packages/icarogw-0.0.1-py3.9.egg/icarogw/priors/custom_math_priors.py:48: RuntimeWarning: divide by zero encountered in true_divide
/home/simone.mastrogiovanni/.conda/envs/icarogw/lib/python3.9/site-packages/icarogw-0.0.1-py3.9.egg/icarogw/priors/custom_math_priors.py:48: RuntimeWarning: divide by zero encountered in true_divide
/home/simone.mastrogiovanni/.conda/envs/icarogw/lib/python3.9/site-packages/icarogw-0.0.1-py3.9.egg/icarogw/priors/custom_math_priors.py:48: RuntimeWarning: divide by zero encountered in true_divide
/home/simone.mastrogiovanni/.conda/envs/icarogw/lib/python3.9/site-packages/icarogw-0.0.1-py3.9.egg/icarogw/priors/custom_math_priors.py:48: RuntimeWarning: divide by zero encountered in true_divide
/home/simone.mastrogiovanni/.conda/envs/icarogw/lib/python3.9/site-packages/icarogw-0.0.1-py3.9.egg/icarogw/priors/custom_math_priors.py:48: RuntimeWarning: divide by zero encountered in true_divide
/home/simone.mastrogiovanni/.conda/envs/icarogw/lib/python3.9/site-packages/icarogw-0.0.1-py3.9.egg/icarogw/priors/custom_math_priors.py:48: RuntimeWarning: divide by zero encountered in true_divide
/home/simone.mastrogiovanni/.conda/envs/icarogw/lib/python3.9/site-packages/icarogw-0.0.1-py3.9.egg/icarogw/priors/custom_math_priors.py:48: RuntimeWarning: divide by zero encountered in true_divide
/home/simone.mastrogiovanni/.conda/envs/icarogw/lib/python3.9/site-packages/icarogw-0.0.1-py3.9.egg/icarogw/priors/custom_math_priors.py:48: RuntimeWarning: divide by zero encountered in true_divide
10:16 bilby INFO    : Written checkpoint file ../run1/dynesty_resume.pickle
/home/simone.mastrogiovanni/.conda/envs/icarogw/lib/python3.9/site-packages/dynesty/plotting.py:245: UserWarning: Attempting to set identical bottom == top == 0.0 results in singular transformations; automatically expanding.
  axes[i].set_ylim([ymin, ymax])
10:26 bilby INFO    : Written checkpoint file ../run1/dynesty_resume.pickle
/home/simone.mastrogiovanni/.conda/envs/icarogw/lib/python3.9/site-packages/dynesty/plotting.py:245: UserWarning: Attempting to set identical bottom == top == 0.0 results in singular transformations; automatically expanding.
  axes[i].set_ylim([ymin, ymax])
10:37 bilby INFO    : Written checkpoint file ../run1/dynesty_resume.pickle
/home/simone.mastrogiovanni/.conda/envs/icarogw/lib/python3.9/site-packages/dynesty/plotting.py:245: UserWarning: Attempting to set identical bottom == top == 0.0 results in singular transformations; automatically expanding.
  axes[i].set_ylim([ymin, ymax])
10:47 bilby INFO    : Written checkpoint file ../run1/dynesty_resume.pickle
/home/simone.mastrogiovanni/.conda/envs/icarogw/lib/python3.9/site-packages/dynesty/plotting.py:245: UserWarning: Attempting to set identical bottom == top == 0.0 results in singular transformations; automatically expanding.
  axes[i].set_ylim([ymin, ymax])
10:57 bilby INFO    : Written checkpoint file ../run1/dynesty_resume.pickle
/home/simone.mastrogiovanni/.conda/envs/icarogw/lib/python3.9/site-packages/dynesty/plotting.py:245: UserWarning: Attempting to set identical bottom == top == 0.0 results in singular transformations; automatically expanding.
  axes[i].set_ylim([ymin, ymax])
11:07 bilby INFO    : Written checkpoint file ../run1/dynesty_resume.pickle
/home/simone.mastrogiovanni/.conda/envs/icarogw/lib/python3.9/site-packages/dynesty/plotting.py:245: UserWarning: Attempting to set identical bottom == top == 0.0 results in singular transformations; automatically expanding.
  axes[i].set_ylim([ymin, ymax])
11:18 bilby INFO    : Written checkpoint file ../run1/dynesty_resume.pickle
/home/simone.mastrogiovanni/.conda/envs/icarogw/lib/python3.9/site-packages/dynesty/plotting.py:245: UserWarning: Attempting to set identical bottom == top == 0.0 results in singular transformations; automatically expanding.
  axes[i].set_ylim([ymin, ymax])
11:28 bilby INFO    : Written checkpoint file ../run1/dynesty_resume.pickle
/home/simone.mastrogiovanni/.conda/envs/icarogw/lib/python3.9/site-packages/dynesty/plotting.py:245: UserWarning: Attempting to set identical bottom == top == 0.0 results in singular transformations; automatically expanding.
  axes[i].set_ylim([ymin, ymax])
11:38 bilby INFO    : Written checkpoint file ../run1/dynesty_resume.pickle
/home/simone.mastrogiovanni/.conda/envs/icarogw/lib/python3.9/site-packages/dynesty/plotting.py:245: UserWarning: Attempting to set identical bottom == top == 0.0 results in singular transformations; automatically expanding.
  axes[i].set_ylim([ymin, ymax])
11:48 bilby INFO    : Written checkpoint file ../run1/dynesty_resume.pickle
/home/simone.mastrogiovanni/.conda/envs/icarogw/lib/python3.9/site-packages/dynesty/plotting.py:245: UserWarning: Attempting to set identical bottom == top == 0.0 results in singular transformations; automatically expanding.
  axes[i].set_ylim([ymin, ymax])
11:58 bilby INFO    : Written checkpoint file ../run1/dynesty_resume.pickle
/home/simone.mastrogiovanni/.conda/envs/icarogw/lib/python3.9/site-packages/dynesty/plotting.py:245: UserWarning: Attempting to set identical bottom == top == 0.0 results in singular transformations; automatically expanding.
  axes[i].set_ylim([ymin, ymax])
12:09 bilby INFO    : Written checkpoint file ../run1/dynesty_resume.pickle
/home/simone.mastrogiovanni/.conda/envs/icarogw/lib/python3.9/site-packages/dynesty/plotting.py:245: UserWarning: Attempting to set identical bottom == top == 0.0 results in singular transformations; automatically expanding.
  axes[i].set_ylim([ymin, ymax])
12:19 bilby INFO    : Written checkpoint file ../run1/dynesty_resume.pickle
/home/simone.mastrogiovanni/.conda/envs/icarogw/lib/python3.9/site-packages/dynesty/plotting.py:245: UserWarning: Attempting to set identical bottom == top == 0.0 results in singular transformations; automatically expanding.
  axes[i].set_ylim([ymin, ymax])
12:29 bilby INFO    : Written checkpoint file ../run1/dynesty_resume.pickle
/home/simone.mastrogiovanni/.conda/envs/icarogw/lib/python3.9/site-packages/dynesty/plotting.py:245: UserWarning: Attempting to set identical bottom == top == 0.0 results in singular transformations; automatically expanding.
  axes[i].set_ylim([ymin, ymax])
12:40 bilby INFO    : Written checkpoint file ../run1/dynesty_resume.pickle
/home/simone.mastrogiovanni/.conda/envs/icarogw/lib/python3.9/site-packages/dynesty/plotting.py:245: UserWarning: Attempting to set identical bottom == top == 0.0 results in singular transformations; automatically expanding.
  axes[i].set_ylim([ymin, ymax])
12:50 bilby INFO    : Written checkpoint file ../run1/dynesty_resume.pickle
/home/simone.mastrogiovanni/.conda/envs/icarogw/lib/python3.9/site-packages/dynesty/plotting.py:245: UserWarning: Attempting to set identical bottom == top == 0.0 results in singular transformations; automatically expanding.
  axes[i].set_ylim([ymin, ymax])
13:01 bilby INFO    : Written checkpoint file ../run1/dynesty_resume.pickle
/home/simone.mastrogiovanni/.conda/envs/icarogw/lib/python3.9/site-packages/dynesty/plotting.py:245: UserWarning: Attempting to set identical bottom == top == 0.0 results in singular transformations; automatically expanding.
  axes[i].set_ylim([ymin, ymax])
13:11 bilby INFO    : Written checkpoint file ../run1/dynesty_resume.pickle
/home/simone.mastrogiovanni/.conda/envs/icarogw/lib/python3.9/site-packages/dynesty/plotting.py:245: UserWarning: Attempting to set identical bottom == top == 0.0 results in singular transformations; automatically expanding.
  axes[i].set_ylim([ymin, ymax])
13:21 bilby INFO    : Written checkpoint file ../run1/dynesty_resume.pickle
/home/simone.mastrogiovanni/.conda/envs/icarogw/lib/python3.9/site-packages/dynesty/plotting.py:245: UserWarning: Attempting to set identical bottom == top == 0.0 results in singular transformations; automatically expanding.
  axes[i].set_ylim([ymin, ymax])
13:31 bilby INFO    : Written checkpoint file ../run1/dynesty_resume.pickle
/home/simone.mastrogiovanni/.conda/envs/icarogw/lib/python3.9/site-packages/dynesty/plotting.py:245: UserWarning: Attempting to set identical bottom == top == 0.0 results in singular transformations; automatically expanding.
  axes[i].set_ylim([ymin, ymax])
13:41 bilby INFO    : Written checkpoint file ../run1/dynesty_resume.pickle
/home/simone.mastrogiovanni/.conda/envs/icarogw/lib/python3.9/site-packages/dynesty/plotting.py:245: UserWarning: Attempting to set identical bottom == top == 0.0 results in singular transformations; automatically expanding.
  axes[i].set_ylim([ymin, ymax])
13:52 bilby INFO    : Written checkpoint file ../run1/dynesty_resume.pickle
/home/simone.mastrogiovanni/.conda/envs/icarogw/lib/python3.9/site-packages/dynesty/plotting.py:245: UserWarning: Attempting to set identical bottom == top == 0.0 results in singular transformations; automatically expanding.
  axes[i].set_ylim([ymin, ymax])
14:02 bilby INFO    : Written checkpoint file ../run1/dynesty_resume.pickle
/home/simone.mastrogiovanni/.conda/envs/icarogw/lib/python3.9/site-packages/dynesty/plotting.py:245: UserWarning: Attempting to set identical bottom == top == 0.0 results in singular transformations; automatically expanding.
  axes[i].set_ylim([ymin, ymax])
14:12 bilby INFO    : Written checkpoint file ../run1/dynesty_resume.pickle
/home/simone.mastrogiovanni/.conda/envs/icarogw/lib/python3.9/site-packages/dynesty/plotting.py:245: UserWarning: Attempting to set identical bottom == top == 0.0 results in singular transformations; automatically expanding.
  axes[i].set_ylim([ymin, ymax])
14:23 bilby INFO    : Written checkpoint file ../run1/dynesty_resume.pickle
/home/simone.mastrogiovanni/.conda/envs/icarogw/lib/python3.9/site-packages/dynesty/plotting.py:245: UserWarning: Attempting to set identical bottom == top == 0.0 results in singular transformations; automatically expanding.
  axes[i].set_ylim([ymin, ymax])
14:34 bilby INFO    : Written checkpoint file ../run1/dynesty_resume.pickle
/home/simone.mastrogiovanni/.conda/envs/icarogw/lib/python3.9/site-packages/dynesty/plotting.py:245: UserWarning: Attempting to set identical bottom == top == 0.0 results in singular transformations; automatically expanding.
  axes[i].set_ylim([ymin, ymax])
14:45 bilby INFO    : Written checkpoint file ../run1/dynesty_resume.pickle
/home/simone.mastrogiovanni/.conda/envs/icarogw/lib/python3.9/site-packages/dynesty/plotting.py:245: UserWarning: Attempting to set identical bottom == top == 0.0 results in singular transformations; automatically expanding.
  axes[i].set_ylim([ymin, ymax])
14:55 bilby INFO    : Written checkpoint file ../run1/dynesty_resume.pickle
/home/simone.mastrogiovanni/.conda/envs/icarogw/lib/python3.9/site-packages/dynesty/plotting.py:245: UserWarning: Attempting to set identical bottom == top == 0.0 results in singular transformations; automatically expanding.
  axes[i].set_ylim([ymin, ymax])
15:06 bilby INFO    : Written checkpoint file ../run1/dynesty_resume.pickle
/home/simone.mastrogiovanni/.conda/envs/icarogw/lib/python3.9/site-packages/dynesty/plotting.py:245: UserWarning: Attempting to set identical bottom == top == 0.0 results in singular transformations; automatically expanding.
  axes[i].set_ylim([ymin, ymax])
15:16 bilby INFO    : Written checkpoint file ../run1/dynesty_resume.pickle
/home/simone.mastrogiovanni/.conda/envs/icarogw/lib/python3.9/site-packages/dynesty/plotting.py:245: UserWarning: Attempting to set identical bottom == top == 0.0 results in singular transformations; automatically expanding.
  axes[i].set_ylim([ymin, ymax])
15:27 bilby INFO    : Written checkpoint file ../run1/dynesty_resume.pickle
/home/simone.mastrogiovanni/.conda/envs/icarogw/lib/python3.9/site-packages/dynesty/plotting.py:245: UserWarning: Attempting to set identical bottom == top == 0.0 results in singular transformations; automatically expanding.
  axes[i].set_ylim([ymin, ymax])
15:38 bilby INFO    : Written checkpoint file ../run1/dynesty_resume.pickle
/home/simone.mastrogiovanni/.conda/envs/icarogw/lib/python3.9/site-packages/dynesty/plotting.py:245: UserWarning: Attempting to set identical bottom == top == 0.0 results in singular transformations; automatically expanding.
  axes[i].set_ylim([ymin, ymax])
15:48 bilby INFO    : Written checkpoint file ../run1/dynesty_resume.pickle
/home/simone.mastrogiovanni/.conda/envs/icarogw/lib/python3.9/site-packages/dynesty/plotting.py:245: UserWarning: Attempting to set identical bottom == top == 0.0 results in singular transformations; automatically expanding.
  axes[i].set_ylim([ymin, ymax])
15:58 bilby INFO    : Written checkpoint file ../run1/dynesty_resume.pickle
/home/simone.mastrogiovanni/.conda/envs/icarogw/lib/python3.9/site-packages/dynesty/plotting.py:245: UserWarning: Attempting to set identical bottom == top == 0.0 results in singular transformations; automatically expanding.
  axes[i].set_ylim([ymin, ymax])
16:09 bilby INFO    : Written checkpoint file ../run1/dynesty_resume.pickle
/home/simone.mastrogiovanni/.conda/envs/icarogw/lib/python3.9/site-packages/dynesty/plotting.py:245: UserWarning: Attempting to set identical bottom == top == 0.0 results in singular transformations; automatically expanding.
  axes[i].set_ylim([ymin, ymax])
16:20 bilby INFO    : Written checkpoint file ../run1/dynesty_resume.pickle
/home/simone.mastrogiovanni/.conda/envs/icarogw/lib/python3.9/site-packages/dynesty/plotting.py:245: UserWarning: Attempting to set identical bottom == top == 0.0 results in singular transformations; automatically expanding.
  axes[i].set_ylim([ymin, ymax])
16:30 bilby INFO    : Written checkpoint file ../run1/dynesty_resume.pickle
/home/simone.mastrogiovanni/.conda/envs/icarogw/lib/python3.9/site-packages/dynesty/plotting.py:245: UserWarning: Attempting to set identical bottom == top == 0.0 results in singular transformations; automatically expanding.
  axes[i].set_ylim([ymin, ymax])
16:41 bilby INFO    : Written checkpoint file ../run1/dynesty_resume.pickle
/home/simone.mastrogiovanni/.conda/envs/icarogw/lib/python3.9/site-packages/dynesty/plotting.py:245: UserWarning: Attempting to set identical bottom == top == 0.0 results in singular transformations; automatically expanding.
  axes[i].set_ylim([ymin, ymax])
16:52 bilby INFO    : Written checkpoint file ../run1/dynesty_resume.pickle
/home/simone.mastrogiovanni/.conda/envs/icarogw/lib/python3.9/site-packages/dynesty/plotting.py:245: UserWarning: Attempting to set identical bottom == top == 0.0 results in singular transformations; automatically expanding.
  axes[i].set_ylim([ymin, ymax])
17:02 bilby INFO    : Written checkpoint file ../run1/dynesty_resume.pickle
/home/simone.mastrogiovanni/.conda/envs/icarogw/lib/python3.9/site-packages/dynesty/plotting.py:245: UserWarning: Attempting to set identical bottom == top == 0.0 results in singular transformations; automatically expanding.
  axes[i].set_ylim([ymin, ymax])
17:13 bilby INFO    : Written checkpoint file ../run1/dynesty_resume.pickle
/home/simone.mastrogiovanni/.conda/envs/icarogw/lib/python3.9/site-packages/dynesty/plotting.py:245: UserWarning: Attempting to set identical bottom == top == 0.0 results in singular transformations; automatically expanding.
  axes[i].set_ylim([ymin, ymax])
17:24 bilby INFO    : Written checkpoint file ../run1/dynesty_resume.pickle
/home/simone.mastrogiovanni/.conda/envs/icarogw/lib/python3.9/site-packages/dynesty/plotting.py:245: UserWarning: Attempting to set identical bottom == top == 0.0 results in singular transformations; automatically expanding.
  axes[i].set_ylim([ymin, ymax])
17:35 bilby INFO    : Written checkpoint file ../run1/dynesty_resume.pickle
/home/simone.mastrogiovanni/.conda/envs/icarogw/lib/python3.9/site-packages/dynesty/plotting.py:245: UserWarning: Attempting to set identical bottom == top == 0.0 results in singular transformations; automatically expanding.
  axes[i].set_ylim([ymin, ymax])
17:45 bilby INFO    : Written checkpoint file ../run1/dynesty_resume.pickle
/home/simone.mastrogiovanni/.conda/envs/icarogw/lib/python3.9/site-packages/dynesty/plotting.py:245: UserWarning: Attempting to set identical bottom == top == 0.0 results in singular transformations; automatically expanding.
  axes[i].set_ylim([ymin, ymax])
17:56 bilby INFO    : Written checkpoint file ../run1/dynesty_resume.pickle
/home/simone.mastrogiovanni/.conda/envs/icarogw/lib/python3.9/site-packages/dynesty/plotting.py:245: UserWarning: Attempting to set identical bottom == top == 0.0 results in singular transformations; automatically expanding.
  axes[i].set_ylim([ymin, ymax])
18:06 bilby INFO    : Written checkpoint file ../run1/dynesty_resume.pickle
/home/simone.mastrogiovanni/.conda/envs/icarogw/lib/python3.9/site-packages/dynesty/plotting.py:245: UserWarning: Attempting to set identical bottom == top == 0.0 results in singular transformations; automatically expanding.
  axes[i].set_ylim([ymin, ymax])
18:17 bilby INFO    : Written checkpoint file ../run1/dynesty_resume.pickle
/home/simone.mastrogiovanni/.conda/envs/icarogw/lib/python3.9/site-packages/dynesty/plotting.py:245: UserWarning: Attempting to set identical bottom == top == 0.0 results in singular transformations; automatically expanding.
  axes[i].set_ylim([ymin, ymax])
18:27 bilby INFO    : Written checkpoint file ../run1/dynesty_resume.pickle
/home/simone.mastrogiovanni/.conda/envs/icarogw/lib/python3.9/site-packages/dynesty/plotting.py:245: UserWarning: Attempting to set identical bottom == top == 0.0 results in singular transformations; automatically expanding.
  axes[i].set_ylim([ymin, ymax])
18:38 bilby INFO    : Written checkpoint file ../run1/dynesty_resume.pickle
/home/simone.mastrogiovanni/.conda/envs/icarogw/lib/python3.9/site-packages/dynesty/plotting.py:245: UserWarning: Attempting to set identical bottom == top == 0.0 results in singular transformations; automatically expanding.
  axes[i].set_ylim([ymin, ymax])
18:49 bilby INFO    : Written checkpoint file ../run1/dynesty_resume.pickle
/home/simone.mastrogiovanni/.conda/envs/icarogw/lib/python3.9/site-packages/dynesty/plotting.py:245: UserWarning: Attempting to set identical bottom == top == 0.0 results in singular transformations; automatically expanding.
  axes[i].set_ylim([ymin, ymax])
18:59 bilby INFO    : Written checkpoint file ../run1/dynesty_resume.pickle
/home/simone.mastrogiovanni/.conda/envs/icarogw/lib/python3.9/site-packages/dynesty/plotting.py:245: UserWarning: Attempting to set identical bottom == top == 0.0 results in singular transformations; automatically expanding.
  axes[i].set_ylim([ymin, ymax])
19:10 bilby INFO    : Written checkpoint file ../run1/dynesty_resume.pickle
/home/simone.mastrogiovanni/.conda/envs/icarogw/lib/python3.9/site-packages/dynesty/plotting.py:245: UserWarning: Attempting to set identical bottom == top == 0.0 results in singular transformations; automatically expanding.
  axes[i].set_ylim([ymin, ymax])
19:21 bilby INFO    : Written checkpoint file ../run1/dynesty_resume.pickle
/home/simone.mastrogiovanni/.conda/envs/icarogw/lib/python3.9/site-packages/dynesty/plotting.py:245: UserWarning: Attempting to set identical bottom == top == 0.0 results in singular transformations; automatically expanding.
  axes[i].set_ylim([ymin, ymax])
19:32 bilby INFO    : Written checkpoint file ../run1/dynesty_resume.pickle
/home/simone.mastrogiovanni/.conda/envs/icarogw/lib/python3.9/site-packages/dynesty/plotting.py:245: UserWarning: Attempting to set identical bottom == top == 0.0 results in singular transformations; automatically expanding.
  axes[i].set_ylim([ymin, ymax])
19:43 bilby INFO    : Written checkpoint file ../run1/dynesty_resume.pickle
/home/simone.mastrogiovanni/.conda/envs/icarogw/lib/python3.9/site-packages/dynesty/plotting.py:245: UserWarning: Attempting to set identical bottom == top == 0.0 results in singular transformations; automatically expanding.
  axes[i].set_ylim([ymin, ymax])
19:54 bilby INFO    : Written checkpoint file ../run1/dynesty_resume.pickle
/home/simone.mastrogiovanni/.conda/envs/icarogw/lib/python3.9/site-packages/dynesty/plotting.py:245: UserWarning: Attempting to set identical bottom == top == 0.0 results in singular transformations; automatically expanding.
  axes[i].set_ylim([ymin, ymax])
20:05 bilby INFO    : Written checkpoint file ../run1/dynesty_resume.pickle
/home/simone.mastrogiovanni/.conda/envs/icarogw/lib/python3.9/site-packages/dynesty/plotting.py:245: UserWarning: Attempting to set identical bottom == top == 0.0 results in singular transformations; automatically expanding.
  axes[i].set_ylim([ymin, ymax])
20:17 bilby INFO    : Written checkpoint file ../run1/dynesty_resume.pickle
/home/simone.mastrogiovanni/.conda/envs/icarogw/lib/python3.9/site-packages/dynesty/plotting.py:245: UserWarning: Attempting to set identical bottom == top == 0.0 results in singular transformations; automatically expanding.
  axes[i].set_ylim([ymin, ymax])
20:28 bilby INFO    : Written checkpoint file ../run1/dynesty_resume.pickle
/home/simone.mastrogiovanni/.conda/envs/icarogw/lib/python3.9/site-packages/dynesty/plotting.py:245: UserWarning: Attempting to set identical bottom == top == 0.0 results in singular transformations; automatically expanding.
  axes[i].set_ylim([ymin, ymax])
20:40 bilby INFO    : Written checkpoint file ../run1/dynesty_resume.pickle
/home/simone.mastrogiovanni/.conda/envs/icarogw/lib/python3.9/site-packages/dynesty/plotting.py:245: UserWarning: Attempting to set identical bottom == top == 0.0 results in singular transformations; automatically expanding.
  axes[i].set_ylim([ymin, ymax])
20:50 bilby INFO    : Written checkpoint file ../run1/dynesty_resume.pickle
/home/simone.mastrogiovanni/.conda/envs/icarogw/lib/python3.9/site-packages/dynesty/plotting.py:245: UserWarning: Attempting to set identical bottom == top == 0.0 results in singular transformations; automatically expanding.
  axes[i].set_ylim([ymin, ymax])
21:01 bilby INFO    : Written checkpoint file ../run1/dynesty_resume.pickle
/home/simone.mastrogiovanni/.conda/envs/icarogw/lib/python3.9/site-packages/dynesty/plotting.py:245: UserWarning: Attempting to set identical bottom == top == 0.0 results in singular transformations; automatically expanding.
  axes[i].set_ylim([ymin, ymax])
21:11 bilby INFO    : Written checkpoint file ../run1/dynesty_resume.pickle
/home/simone.mastrogiovanni/.conda/envs/icarogw/lib/python3.9/site-packages/dynesty/plotting.py:245: UserWarning: Attempting to set identical bottom == top == 0.0 results in singular transformations; automatically expanding.
  axes[i].set_ylim([ymin, ymax])
21:21 bilby INFO    : Written checkpoint file ../run1/dynesty_resume.pickle
/home/simone.mastrogiovanni/.conda/envs/icarogw/lib/python3.9/site-packages/dynesty/plotting.py:245: UserWarning: Attempting to set identical bottom == top == 0.0 results in singular transformations; automatically expanding.
  axes[i].set_ylim([ymin, ymax])
21:32 bilby INFO    : Written checkpoint file ../run1/dynesty_resume.pickle
21:32 bilby INFO    : Writing 103 current samples to ../run1/dynesty_samples.dat
/home/simone.mastrogiovanni/.conda/envs/icarogw/lib/python3.9/site-packages/dynesty/plotting.py:245: UserWarning: Attempting to set identical bottom == top == 0.0 results in singular transformations; automatically expanding.
  axes[i].set_ylim([ymin, ymax])
21:42 bilby INFO    : Written checkpoint file ../run1/dynesty_resume.pickle
21:42 bilby INFO    : Writing 106 current samples to ../run1/dynesty_samples.dat
/home/simone.mastrogiovanni/.conda/envs/icarogw/lib/python3.9/site-packages/dynesty/plotting.py:245: UserWarning: Attempting to set identical bottom == top == 0.0 results in singular transformations; automatically expanding.
  axes[i].set_ylim([ymin, ymax])
21:52 bilby INFO    : Written checkpoint file ../run1/dynesty_resume.pickle
21:52 bilby INFO    : Writing 110 current samples to ../run1/dynesty_samples.dat
/home/simone.mastrogiovanni/.conda/envs/icarogw/lib/python3.9/site-packages/dynesty/plotting.py:245: UserWarning: Attempting to set identical bottom == top == 0.0 results in singular transformations; automatically expanding.
  axes[i].set_ylim([ymin, ymax])
22:03 bilby INFO    : Written checkpoint file ../run1/dynesty_resume.pickle
22:03 bilby INFO    : Writing 123 current samples to ../run1/dynesty_samples.dat
/home/simone.mastrogiovanni/.conda/envs/icarogw/lib/python3.9/site-packages/dynesty/plotting.py:245: UserWarning: Attempting to set identical bottom == top == 0.0 results in singular transformations; automatically expanding.
  axes[i].set_ylim([ymin, ymax])
22:13 bilby INFO    : Written checkpoint file ../run1/dynesty_resume.pickle
22:13 bilby INFO    : Writing 128 current samples to ../run1/dynesty_samples.dat
/home/simone.mastrogiovanni/.conda/envs/icarogw/lib/python3.9/site-packages/dynesty/plotting.py:245: UserWarning: Attempting to set identical bottom == top == 0.0 results in singular transformations; automatically expanding.
  axes[i].set_ylim([ymin, ymax])
22:24 bilby INFO    : Written checkpoint file ../run1/dynesty_resume.pickle
22:24 bilby INFO    : Writing 147 current samples to ../run1/dynesty_samples.dat
/home/simone.mastrogiovanni/.conda/envs/icarogw/lib/python3.9/site-packages/dynesty/plotting.py:245: UserWarning: Attempting to set identical bottom == top == 0.0 results in singular transformations; automatically expanding.
  axes[i].set_ylim([ymin, ymax])
22:34 bilby INFO    : Written checkpoint file ../run1/dynesty_resume.pickle
/home/simone.mastrogiovanni/.conda/envs/icarogw/lib/python3.9/site-packages/dynesty/plotting.py:245: UserWarning: Attempting to set identical bottom == top == 0.0 results in singular transformations; automatically expanding.
  axes[i].set_ylim([ymin, ymax])
22:45 bilby INFO    : Written checkpoint file ../run1/dynesty_resume.pickle
22:45 bilby INFO    : Writing 105 current samples to ../run1/dynesty_samples.dat
/home/simone.mastrogiovanni/.conda/envs/icarogw/lib/python3.9/site-packages/dynesty/plotting.py:245: UserWarning: Attempting to set identical bottom == top == 0.0 results in singular transformations; automatically expanding.
  axes[i].set_ylim([ymin, ymax])
22:55 bilby INFO    : Written checkpoint file ../run1/dynesty_resume.pickle
/home/simone.mastrogiovanni/.conda/envs/icarogw/lib/python3.9/site-packages/dynesty/plotting.py:245: UserWarning: Attempting to set identical bottom == top == 0.0 results in singular transformations; automatically expanding.
  axes[i].set_ylim([ymin, ymax])
23:06 bilby INFO    : Written checkpoint file ../run1/dynesty_resume.pickle
23:06 bilby INFO    : Writing 115 current samples to ../run1/dynesty_samples.dat
/home/simone.mastrogiovanni/.conda/envs/icarogw/lib/python3.9/site-packages/dynesty/plotting.py:245: UserWarning: Attempting to set identical bottom == top == 0.0 results in singular transformations; automatically expanding.
  axes[i].set_ylim([ymin, ymax])
23:17 bilby INFO    : Written checkpoint file ../run1/dynesty_resume.pickle
23:17 bilby INFO    : Writing 136 current samples to ../run1/dynesty_samples.dat
/home/simone.mastrogiovanni/.conda/envs/icarogw/lib/python3.9/site-packages/dynesty/plotting.py:245: UserWarning: Attempting to set identical bottom == top == 0.0 results in singular transformations; automatically expanding.
  axes[i].set_ylim([ymin, ymax])
23:28 bilby INFO    : Written checkpoint file ../run1/dynesty_resume.pickle
23:28 bilby INFO    : Writing 145 current samples to ../run1/dynesty_samples.dat
/home/simone.mastrogiovanni/.conda/envs/icarogw/lib/python3.9/site-packages/dynesty/plotting.py:245: UserWarning: Attempting to set identical bottom == top == 0.0 results in singular transformations; automatically expanding.
  axes[i].set_ylim([ymin, ymax])
23:38 bilby INFO    : Written checkpoint file ../run1/dynesty_resume.pickle
23:38 bilby INFO    : Writing 147 current samples to ../run1/dynesty_samples.dat
/home/simone.mastrogiovanni/.conda/envs/icarogw/lib/python3.9/site-packages/dynesty/plotting.py:245: UserWarning: Attempting to set identical bottom == top == 0.0 results in singular transformations; automatically expanding.
  axes[i].set_ylim([ymin, ymax])
23:49 bilby INFO    : Written checkpoint file ../run1/dynesty_resume.pickle
23:49 bilby INFO    : Writing 185 current samples to ../run1/dynesty_samples.dat
/home/simone.mastrogiovanni/.conda/envs/icarogw/lib/python3.9/site-packages/dynesty/plotting.py:245: UserWarning: Attempting to set identical bottom == top == 0.0 results in singular transformations; automatically expanding.
  axes[i].set_ylim([ymin, ymax])
00:01 bilby INFO    : Written checkpoint file ../run1/dynesty_resume.pickle
00:01 bilby INFO    : Writing 161 current samples to ../run1/dynesty_samples.dat
/home/simone.mastrogiovanni/.conda/envs/icarogw/lib/python3.9/site-packages/dynesty/plotting.py:245: UserWarning: Attempting to set identical bottom == top == 0.0 results in singular transformations; automatically expanding.
  axes[i].set_ylim([ymin, ymax])
00:12 bilby INFO    : Written checkpoint file ../run1/dynesty_resume.pickle
00:12 bilby INFO    : Writing 186 current samples to ../run1/dynesty_samples.dat
/home/simone.mastrogiovanni/.conda/envs/icarogw/lib/python3.9/site-packages/dynesty/plotting.py:245: UserWarning: Attempting to set identical bottom == top == 0.0 results in singular transformations; automatically expanding.
  axes[i].set_ylim([ymin, ymax])
00:23 bilby INFO    : Written checkpoint file ../run1/dynesty_resume.pickle
00:23 bilby INFO    : Writing 217 current samples to ../run1/dynesty_samples.dat
/home/simone.mastrogiovanni/.conda/envs/icarogw/lib/python3.9/site-packages/dynesty/plotting.py:245: UserWarning: Attempting to set identical bottom == top == 0.0 results in singular transformations; automatically expanding.
  axes[i].set_ylim([ymin, ymax])
00:34 bilby INFO    : Written checkpoint file ../run1/dynesty_resume.pickle
00:34 bilby INFO    : Writing 230 current samples to ../run1/dynesty_samples.dat
/home/simone.mastrogiovanni/.conda/envs/icarogw/lib/python3.9/site-packages/dynesty/plotting.py:245: UserWarning: Attempting to set identical bottom == top == 0.0 results in singular transformations; automatically expanding.
  axes[i].set_ylim([ymin, ymax])
00:45 bilby INFO    : Written checkpoint file ../run1/dynesty_resume.pickle
00:45 bilby INFO    : Writing 207 current samples to ../run1/dynesty_samples.dat
/home/simone.mastrogiovanni/.conda/envs/icarogw/lib/python3.9/site-packages/dynesty/plotting.py:245: UserWarning: Attempting to set identical bottom == top == 0.0 results in singular transformations; automatically expanding.
  axes[i].set_ylim([ymin, ymax])
00:57 bilby INFO    : Written checkpoint file ../run1/dynesty_resume.pickle
00:57 bilby INFO    : Writing 244 current samples to ../run1/dynesty_samples.dat
/home/simone.mastrogiovanni/.conda/envs/icarogw/lib/python3.9/site-packages/dynesty/plotting.py:245: UserWarning: Attempting to set identical bottom == top == 0.0 results in singular transformations; automatically expanding.
  axes[i].set_ylim([ymin, ymax])
01:08 bilby INFO    : Written checkpoint file ../run1/dynesty_resume.pickle
01:08 bilby INFO    : Writing 269 current samples to ../run1/dynesty_samples.dat
/home/simone.mastrogiovanni/.conda/envs/icarogw/lib/python3.9/site-packages/dynesty/plotting.py:245: UserWarning: Attempting to set identical bottom == top == 0.0 results in singular transformations; automatically expanding.
  axes[i].set_ylim([ymin, ymax])
01:18 bilby INFO    : Written checkpoint file ../run1/dynesty_resume.pickle
01:18 bilby INFO    : Writing 280 current samples to ../run1/dynesty_samples.dat
/home/simone.mastrogiovanni/.conda/envs/icarogw/lib/python3.9/site-packages/dynesty/plotting.py:245: UserWarning: Attempting to set identical bottom == top == 0.0 results in singular transformations; automatically expanding.
  axes[i].set_ylim([ymin, ymax])
01:29 bilby INFO    : Written checkpoint file ../run1/dynesty_resume.pickle
01:29 bilby INFO    : Writing 314 current samples to ../run1/dynesty_samples.dat
/home/simone.mastrogiovanni/.conda/envs/icarogw/lib/python3.9/site-packages/dynesty/plotting.py:245: UserWarning: Attempting to set identical bottom == top == 0.0 results in singular transformations; automatically expanding.
  axes[i].set_ylim([ymin, ymax])
01:41 bilby INFO    : Written checkpoint file ../run1/dynesty_resume.pickle
01:41 bilby INFO    : Writing 352 current samples to ../run1/dynesty_samples.dat
/home/simone.mastrogiovanni/.conda/envs/icarogw/lib/python3.9/site-packages/dynesty/plotting.py:245: UserWarning: Attempting to set identical bottom == top == 0.0 results in singular transformations; automatically expanding.
  axes[i].set_ylim([ymin, ymax])
01:53 bilby INFO    : Written checkpoint file ../run1/dynesty_resume.pickle
01:53 bilby INFO    : Writing 395 current samples to ../run1/dynesty_samples.dat
/home/simone.mastrogiovanni/.conda/envs/icarogw/lib/python3.9/site-packages/dynesty/plotting.py:245: UserWarning: Attempting to set identical bottom == top == 0.0 results in singular transformations; automatically expanding.
  axes[i].set_ylim([ymin, ymax])
02:04 bilby INFO    : Written checkpoint file ../run1/dynesty_resume.pickle
02:04 bilby INFO    : Writing 434 current samples to ../run1/dynesty_samples.dat
/home/simone.mastrogiovanni/.conda/envs/icarogw/lib/python3.9/site-packages/dynesty/plotting.py:245: UserWarning: Attempting to set identical bottom == top == 0.0 results in singular transformations; automatically expanding.
  axes[i].set_ylim([ymin, ymax])
02:15 bilby INFO    : Written checkpoint file ../run1/dynesty_resume.pickle
02:15 bilby INFO    : Writing 437 current samples to ../run1/dynesty_samples.dat
/home/simone.mastrogiovanni/.conda/envs/icarogw/lib/python3.9/site-packages/dynesty/plotting.py:245: UserWarning: Attempting to set identical bottom == top == 0.0 results in singular transformations; automatically expanding.
  axes[i].set_ylim([ymin, ymax])
