0.45	0.9681
0.5	0.9776
0.55	0.9796
0.6	0.9735
0.65	0.9796
0.7	0.9844
0.75	0.9701
0.8	0.9511
0.85	0.93
0.9	0.8899
0.95	0.8471
1	0.8281
1.05	0.8227
1.1	0.8077
1.15	0.7989
1.2	0.7378
1.25	0.4844
1.3	0.1719
1.35	0.0374
1.4	0.0143
1.45	0.0082
1.5	0.0068
1.55	0.0156
1.6	0.0387
1.65	0.0836
1.7	0.144
1.75	0.1943
1.8	0.2024
1.85	0.1997
1.9	0.1739
1.95	0.1311
2	0.1005
2.05	0.087
2.1	0.0808
2.2	0.0802
2.25	0.0876
2.3	0.1114
2.35	0.2357
2.4	0.3512
2.45	0.3933
2.5	0.447
2.55	0.4918
2.6	0.5075
2.65	0.5156
2.7	0.5177
2.75	0.5183
2.8	0.534
2.85	0.5571
2.9	0.5815
2.95	0.6073
3	0.6474
3.05	0.6658
3.1	0.6848
3.15	0.676
3.2	0.6651
3.25	0.6658
