/home1/srashti.goyal/tgr-lensing/codes/real_events/o1_o2/GW150914/20220825/GR/result/GW150914_GR_data0_1126259462-391_analysis_H1L1_dynesty_merge_result.json
/home1/srashti.goyal/tgr-lensing/codes/real_events/o1_o2/GW151012/20220825/GR/result/GW151012_GR_data0_1128678900-4_analysis_H1L1_dynesty_merge_result.json
/home1/srashti.goyal/tgr-lensing/codes/real_events/o1_o2/GW151226/20220825/GR/result/GW151226_GR_data0_1135136350-6_analysis_H1L1_dynesty_merge_result.json
/home1/srashti.goyal/tgr-lensing/codes/real_events/o1_o2/GW170104/20220825/GR/result/GW170104_GR_data0_1167559936-6_analysis_H1L1_dynesty_merge_result.json
/home1/srashti.goyal/tgr-lensing/codes/real_events/o1_o2/GW170729/20220825/GR/result/GW170729_GR_data0_1185389807-3_analysis_H1L1V1_dynesty_merge_result.json
/home1/srashti.goyal/tgr-lensing/codes/real_events/o1_o2/GW170809/20220825/GR/result/GW170809_GR_data0_1186302519-7_analysis_H1L1V1_dynesty_merge_result.json
/home1/srashti.goyal/tgr-lensing/codes/real_events/o1_o2/GW170814/20220825/GR/result/GW170814_GR_data0_1186741861-5_analysis_H1L1V1_dynesty_merge_result.json
/home1/srashti.goyal/tgr-lensing/codes/real_events/o1_o2/GW170818/20220825/GR/result/GW170818_GR_data0_1187058327-1_analysis_H1L1V1_dynesty_merge_result.json
/home1/srashti.goyal/tgr-lensing/codes/real_events/o1_o2/GW170823/20220825/GR/result/GW170823_GR_data0_1187529256-5_analysis_H1L1_dynesty_merge_result.json