,t12_snr20,phi_lens_snr20,seed_snr20,snr_snr20,ngr_label_snr20,gr_label_snr20,Log evidence GR_snr20,Log BF GR_snr20,Log evidence nonGR_snr20,Log BF nonGR_snr20,Log_BF_NGR_GR_snr20,Log_BF_NGR_GR_frombf_snr20
0,0,0,888888,20,nGR_rec_t12_0_phi_0_snr_20_seed_888888,GR_rec_t12_0_phi_0_snr_20_seed_888888,-24280.384466109284,140.79104635522182,-24282.350351894343,138.82516057016127,-1.965885785059072,-1.96588578506055
1,0.001,0.6,888888,20,nGR_rec_t12_0.001_phi_0.6_snr_20_seed_888888,GR_rec_t12_0.001_phi_0.6_snr_20_seed_888888,-24288.272535961565,123.0831722348361,-24284.155364414346,127.20034378205528,4.117171547219186,4.117171547219186
2,0.003,0.6,888888,20,nGR_rec_t12_0.003_phi_0.6_snr_20_seed_888888,GR_rec_t12_0.003_phi_0.6_snr_20_seed_888888,-24357.21475875353,71.49006910155747,-24289.576769302195,139.12805855289182,67.63798945133385,67.63798945133435
3,0.01,0.6,888888,20,nGR_rec_t12_0.01_phi_0.6_snr_20_seed_888888,GR_rec_t12_0.01_phi_0.6_snr_20_seed_888888,-24339.807315055514,105.72287667718041,-24283.522381538492,162.00781019420296,56.28493351702127,56.28493351702255
4,0.03,0.6,888888,20,nGR_rec_t12_0.03_phi_0.6_snr_20_seed_888888,GR_rec_t12_0.03_phi_0.6_snr_20_seed_888888,-24357.61278537266,101.25658697211928,-24287.110602074306,171.75877027047153,70.5021832983548,70.50218329835225
