,Event,log BF,t12 5 percentile ms,t12 50 percentile ms,t12 95 percentile ms
0,GW190521,3.2,8.40255879643485,10.2928934851211,20.976218615295615
1,GW190910_112807,0.8,12.9582089391531,47.2551031112764,95.71969114461277
2,GW170823,0.8,33.683278012518564,56.3884499240759,79.69542094146786
3,GW191109_010717,0.8,3.84787582761,10.995740141895201,17.913761141036503
4,GW191129_134029,0.1,1.4443160992468,22.4800284455605,87.84307780319651
5,GW190512_180714,-0.0,11.000578996733301,11.9195897352457,77.72199151811371
6,GW200219_094415,-0.3,2.6245870874644,46.4380917753488,81.3481634357353
7,GW190630_185205,-0.4,2.0926014342757,53.8562772362218,78.9215087606688
8,GW190828_065509,-0.5,2.005594828852,42.8990881368402,90.2871489810768
9,GW170729,-0.6,2.7989833210253297,52.3149044695613,91.50201533692012
10,GW200225_060421,-0.6,1.1440534376805,66.8372419380047,79.8854056619069
11,GW190915_235702,-0.7,3.4891022842505,48.409711588060205,92.88240836468432
12,GW190517_055101,-0.7,1.7577285094042001,47.99379202308355,74.65798185039044
13,GW190513_205428,-0.8,1.9122390116596,15.8680095181013,75.71858854594717
14,GW190421_213856,-0.8,1.8526102920837002,40.8109003019573,94.30148642966876
15,GW191215_223052,-0.8,2.3692909941581997,35.442199432131,88.06040070996323
16,GW190708_232457,-1.1,1.080103702972,68.3718156650754,95.92833987374189
17,GW190519_153544,-1.2,1.4115936878801998,31.5048226112132,86.87622429810351
18,GW170809,-1.2,1.4463976723087,28.4810887443829,53.585933085946635
19,GW200112_155838,-1.3,1.2702731052129999,64.36468835166221,99.849624898886
20,GW151012,-1.3,1.3706656764956,35.3553931309212,88.62028027706455
21,GW151226,-1.3,2.3846726078137,40.9861463293995,78.38629978999059
22,GW190408_181802,-1.3,1.4803351010812,15.358260717845749,89.51609621623841
23,GW190706_222641,-1.4,1.0516272765000398,33.4069927203551,91.28354449188899
24,GW191222_033537,-1.4,1.5434555385316,17.8887903347455,92.8158909058766
25,GW190828_063405,-1.5,2.1366842429082,45.3707834043839,89.80198509549369
26,GW170814,-1.6,2.8936393923690606,44.3908196708959,96.33479547061215
27,GW190707_093326,-1.7,0.5051380414564,32.5021328375482,88.08116106318529
28,GW190503_185404,-1.8,0.7200796532090751,37.4244934789646,65.9369858379055
29,GW170104,-1.9,0.7690669599870399,31.8631105951911,89.5710732046081
30,GW190727_060333,-2.0,0.3679724572945,6.4414444198459,71.2202219674593
31,GW190521_074359,-2.0,0.4961817546556,17.729626435882302,85.7033876572467
32,GW200208_130117,-2.2,0.13773231995753998,29.8224587618147,73.88498576881057
33,GW170818,-2.3,0.6232998486734,41.275099686596306,52.0151421019317
34,GW150914,-2.5,0.47071806907220004,22.9382822204072,73.7588493471246
35,GW190602_175927,-2.8,0.5017532044333,26.4274307289907,93.63340992407281
36,GW200224_222234,-3.0,0.1789149183253,1.7927405153590998,72.7861757909416
37,GW190720_000836,-3.4,0.09179839455120131,2.4082668602527,82.83515492654703
38,GW200311_115853,-3.7,0.03895412343049576,0.28774224678270005,0.5752219814712249
39,GW191216_213338,-3.9,0.1863082891734,20.7055001377286,66.2040929282649
40,GW200129_065458,-4.5,0.04502203369827207,0.5839312992679,13.9205804099091
41,GW200202_154313,-4.8,0.03201547659799353,0.366212037273,1.5912826910397997
42,GW200316_215756,-5.5,0.6369814173569001,26.890049272176,91.314451460483
