Event Name LVC,Prod,PATH to GR samples,PATH to nonGR samples,Log evidence GR,Log evidence nonGR,Plots,Status
GW190412,ProdF5,/home/daniel.williams/events/O3/o3a/run_directories/S190412a/ProdF5/result/ProdF5_data0_1239082262-17041_analysis_H1L1V1_dynesty_merge_result.json,/home/aditya.vijaykumar/public_html/work/lensing_tgr/runs/GW190412/20220130/samples/GW190412_ProdF5_data0_1239082262-17041_analysis_H1L1V1_dynesty_merge_GW190412_ProdF5_data0_1239082262-17041_analysis_H1L1V1_dynesty_merge_result.json,,,,
S200129a,Prod5,/home/daniel.williams/events/O3/o3b/run_directories/S200129a/Prod5/result/Prod5_data0_1264316116-433214_analysis_H1L1V1_dynesty_merge_result.json,/home/aditya.vijaykumar/public_html/work/lensing_tgr/runs/S200129a/20220130/samples/S200129a_Prod5_data0_1264316116-433214_analysis_H1L1V1_dynesty_merge_S200129a_Prod5_data0_1264316116-433214_analysis_H1L1V1_dynesty_merge_result.json,,,,
S190521b,ProdF5,/home/daniel.williams/events/O3/o3a_final/run_directories/S190521b/ProdF5/result/ProdF5_data0_1242459857-466309_analysis_H1L1_dynesty_merge_result.json,/home/aditya.vijaykumar/public_html/work/lensing_tgr/runs/S190521b/20220130/samples/S190521b_ProdF5_data0_1242459857-466309_analysis_H1L1_dynesty_merge_S190521b_ProdF5_data0_1242459857-466309_analysis_H1L1_dynesty_merge_result.json,,,,
S200112a,Prod8,/home/daniel.williams/events/O3/o3b/run_directories/S200112a/Prod8/result/Prod8_data0_1262879936-090936_analysis_L1V1_dynesty_merge_result.json,/home/aditya.vijaykumar/public_html/work/lensing_tgr/runs/S200112a/20220130/samples/S200112a_Prod8_data0_1262879936-090936_analysis_L1V1_dynesty_merge_S200112a_Prod8_data0_1262879936-090936_analysis_L1V1_dynesty_merge_result.json,,,,
S200224a,Prod5,/home/daniel.williams/events/O3/o3b/run_directories/S200224a/Prod5/result/Prod5_data0_1266618172-401773_analysis_H1L1V1_dynesty_merge_result.json,/home/aditya.vijaykumar/public_html/work/lensing_tgr/runs/S200224a/20220130/samples/S200224a_Prod5_data0_1266618172-401773_analysis_H1L1V1_dynesty_merge_S200224a_Prod5_data0_1266618172-401773_analysis_H1L1V1_dynesty_merge_result.json,,,,