,gr_res,nongr_res,injection number,GR logBF,nGR logBF,GR logZ,nGR logZ,log_Z_ngr_gr,log_BF_ngr_gr
0,/home1/srashti.goyal/tgr-lensing/codes/S190521g_bilby_pipe/background/GR_rec_09092022/final_result/GRinj_GR_rec_1_100_data0_1242442967-459473_analysis_H1L1V1_merge_result.json,/home1/srashti.goyal/tgr-lensing/codes/S190521g_bilby_pipe/background/nGR_rec_09092022/final_result/GRinj_nGR_rec_1_100_data0_1242442967-459473_analysis_H1L1V1_merge_result.json,0,65.35947546590978,71.31772079276016,-2457.0448349113476,-2489.653633272987,-32.6087983616394,5.958245326850374
1,/home1/srashti.goyal/tgr-lensing/codes/S190521g_bilby_pipe/background/GR_rec_09092022/final_result/GRinj_GR_rec_1_100_data1_1242442967-459473_analysis_H1L1V1_merge_result.json,/home1/srashti.goyal/tgr-lensing/codes/S190521g_bilby_pipe/background/nGR_rec_09092022/final_result/GRinj_nGR_rec_1_100_data1_1242442967-459473_analysis_H1L1V1_merge_result.json,1,121.56210557659097,77.79540211908761,-2572.4625557402346,-2479.181180680664,93.28137505957056,-43.766703457503354
2,/home1/srashti.goyal/tgr-lensing/codes/S190521g_bilby_pipe/background/GR_rec_09092022/final_result/GRinj_GR_rec_1_100_data2_1242442967-459473_analysis_H1L1V1_merge_result.json,/home1/srashti.goyal/tgr-lensing/codes/S190521g_bilby_pipe/background/nGR_rec_09092022/final_result/GRinj_nGR_rec_1_100_data2_1242442967-459473_analysis_H1L1V1_merge_result.json,2,57.089106406394876,63.51424271714495,-2421.245559353008,-2513.810778442366,-92.56521908935792,6.4251363107500765
3,/home1/srashti.goyal/tgr-lensing/codes/S190521g_bilby_pipe/background/GR_rec_09092022/final_result/GRinj_GR_rec_1_100_data3_1242442967-459473_analysis_H1L1V1_merge_result.json,/home1/srashti.goyal/tgr-lensing/codes/S190521g_bilby_pipe/background/nGR_rec_09092022/final_result/GRinj_nGR_rec_1_100_data3_1242442967-459473_analysis_H1L1V1_merge_result.json,3,68.88161261717187,84.050303652215,-2467.7875000368017,-2417.425688434516,50.3618116022858,15.168691035043139
4,/home1/srashti.goyal/tgr-lensing/codes/S190521g_bilby_pipe/background/GR_rec_09092022/final_result/GRinj_GR_rec_1_100_data4_1242442967-459473_analysis_H1L1V1_merge_result.json,/home1/srashti.goyal/tgr-lensing/codes/S190521g_bilby_pipe/background/nGR_rec_09092022/final_result/GRinj_nGR_rec_1_100_data4_1242442967-459473_analysis_H1L1V1_merge_result.json,4,88.60432609563895,95.95337435024749,-2513.7546636914753,-2558.568422523212,-44.81375883173678,7.349048254608533
5,/home1/srashti.goyal/tgr-lensing/codes/S190521g_bilby_pipe/background/GR_rec_09092022/final_result/GRinj_GR_rec_1_100_data5_1242442967-459473_analysis_H1L1V1_merge_result.json,/home1/srashti.goyal/tgr-lensing/codes/S190521g_bilby_pipe/background/nGR_rec_09092022/final_result/GRinj_nGR_rec_1_100_data5_1242442967-459473_analysis_H1L1V1_merge_result.json,5,67.63757684021766,64.6469095503412,-2407.7435077070586,-2444.739159380791,-36.99565167373248,-2.9906672898764555
6,/home1/srashti.goyal/tgr-lensing/codes/S190521g_bilby_pipe/background/GR_rec_09092022/final_result/GRinj_GR_rec_1_100_data6_1242442967-459473_analysis_H1L1V1_merge_result.json,/home1/srashti.goyal/tgr-lensing/codes/S190521g_bilby_pipe/background/nGR_rec_09092022/final_result/GRinj_nGR_rec_1_100_data6_1242442967-459473_analysis_H1L1V1_merge_result.json,6,64.16516769495729,79.34724001179711,-2501.842942096852,-2446.422810032415,55.420132064436984,15.182072316839822
7,/home1/srashti.goyal/tgr-lensing/codes/S190521g_bilby_pipe/background/GR_rec_09092022/final_result/GRinj_GR_rec_1_100_data7_1242442967-459473_analysis_H1L1V1_merge_result.json,/home1/srashti.goyal/tgr-lensing/codes/S190521g_bilby_pipe/background/nGR_rec_09092022/final_result/GRinj_nGR_rec_1_100_data7_1242442967-459473_analysis_H1L1V1_merge_result.json,7,48.81972015053498,40.98677906081184,-2504.7664553296177,-2493.206195043822,11.56026028579572,-7.8329410897231355
8,/home1/srashti.goyal/tgr-lensing/codes/S190521g_bilby_pipe/background/GR_rec_09092022/final_result/GRinj_GR_rec_1_100_data8_1242442967-459473_analysis_H1L1V1_merge_result.json,/home1/srashti.goyal/tgr-lensing/codes/S190521g_bilby_pipe/background/nGR_rec_09092022/final_result/GRinj_nGR_rec_1_100_data8_1242442967-459473_analysis_H1L1V1_merge_result.json,8,66.99192627946877,55.18633978945127,-2435.759822098608,-2411.154475273334,24.605346825273955,-11.805586490017504
9,/home1/srashti.goyal/tgr-lensing/codes/S190521g_bilby_pipe/background/GR_rec_09092022/final_result/GRinj_GR_rec_1_100_data9_1242442967-459473_analysis_H1L1V1_merge_result.json,/home1/srashti.goyal/tgr-lensing/codes/S190521g_bilby_pipe/background/nGR_rec_09092022/final_result/GRinj_nGR_rec_1_100_data9_1242442967-459473_analysis_H1L1V1_merge_result.json,9,85.17755258865691,70.68624975170633,-2465.857221016334,-2525.385185403161,-59.52796438682708,-14.491302836950581
10,/home1/srashti.goyal/tgr-lensing/codes/S190521g_bilby_pipe/background/GR_rec_09092022/final_result/GRinj_GR_rec_1_100_data10_1242442967-459473_analysis_H1L1V1_merge_result.json,/home1/srashti.goyal/tgr-lensing/codes/S190521g_bilby_pipe/background/nGR_rec_09092022/final_result/GRinj_nGR_rec_1_100_data10_1242442967-459473_analysis_H1L1V1_merge_result.json,10,72.7968379373774,69.92135598479763,-2457.425347324958,-2467.6830291134766,-10.257681788518767,-2.8754819525797757
11,/home1/srashti.goyal/tgr-lensing/codes/S190521g_bilby_pipe/background/GR_rec_09092022/final_result/GRinj_GR_rec_1_100_data11_1242442967-459473_analysis_H1L1V1_merge_result.json,/home1/srashti.goyal/tgr-lensing/codes/S190521g_bilby_pipe/background/nGR_rec_09092022/final_result/GRinj_nGR_rec_1_100_data11_1242442967-459473_analysis_H1L1V1_merge_result.json,11,85.84415236338464,82.18084578714888,-2489.62144598562,-2524.3332377799347,-34.71179179431465,-3.6633065762357546
12,/home1/srashti.goyal/tgr-lensing/codes/S190521g_bilby_pipe/background/GR_rec_09092022/final_result/GRinj_GR_rec_1_100_data12_1242442967-459473_analysis_H1L1V1_merge_result.json,/home1/srashti.goyal/tgr-lensing/codes/S190521g_bilby_pipe/background/nGR_rec_09092022/final_result/GRinj_nGR_rec_1_100_data12_1242442967-459473_analysis_H1L1V1_merge_result.json,12,85.55963190755119,59.8292694673537,-2485.0513523550603,-2438.704676250743,46.34667610431734,-25.730362440197496
13,/home1/srashti.goyal/tgr-lensing/codes/S190521g_bilby_pipe/background/GR_rec_09092022/final_result/GRinj_GR_rec_1_100_data13_1242442967-459473_analysis_H1L1V1_merge_result.json,/home1/srashti.goyal/tgr-lensing/codes/S190521g_bilby_pipe/background/nGR_rec_09092022/final_result/GRinj_nGR_rec_1_100_data13_1242442967-459473_analysis_H1L1V1_merge_result.json,13,58.80512306770606,30.565733283316604,-2506.1164212185918,-2456.155590928116,49.96083029047577,-28.23938978438946
14,/home1/srashti.goyal/tgr-lensing/codes/S190521g_bilby_pipe/background/GR_rec_09092022/final_result/GRinj_GR_rec_1_100_data14_1242442967-459473_analysis_H1L1V1_merge_result.json,/home1/srashti.goyal/tgr-lensing/codes/S190521g_bilby_pipe/background/nGR_rec_09092022/final_result/GRinj_nGR_rec_1_100_data14_1242442967-459473_analysis_H1L1V1_merge_result.json,14,66.18019172970799,115.22736404828811,-2461.5280263704562,-2439.2945896885367,22.233436681919557,49.047172318580124
15,/home1/srashti.goyal/tgr-lensing/codes/S190521g_bilby_pipe/background/GR_rec_09092022/final_result/GRinj_GR_rec_1_100_data15_1242442967-459473_analysis_H1L1V1_merge_result.json,/home1/srashti.goyal/tgr-lensing/codes/S190521g_bilby_pipe/background/nGR_rec_09092022/final_result/GRinj_nGR_rec_1_100_data15_1242442967-459473_analysis_H1L1V1_merge_result.json,15,59.437321083943516,55.25789083760856,-2519.6330672315803,-2376.4695414194016,143.1635258121787,-4.1794302463349595
16,/home1/srashti.goyal/tgr-lensing/codes/S190521g_bilby_pipe/background/GR_rec_09092022/final_result/GRinj_GR_rec_1_100_data16_1242442967-459473_analysis_H1L1V1_merge_result.json,/home1/srashti.goyal/tgr-lensing/codes/S190521g_bilby_pipe/background/nGR_rec_09092022/final_result/GRinj_nGR_rec_1_100_data16_1242442967-459473_analysis_H1L1V1_merge_result.json,16,40.57496512143416,61.14830302981454,-2450.8816384427496,-2498.0234073602323,-47.14176891748275,20.57333790838038
17,/home1/srashti.goyal/tgr-lensing/codes/S190521g_bilby_pipe/background/GR_rec_09092022/final_result/GRinj_GR_rec_1_100_data17_1242442967-459473_analysis_H1L1V1_merge_result.json,/home1/srashti.goyal/tgr-lensing/codes/S190521g_bilby_pipe/background/nGR_rec_09092022/final_result/GRinj_nGR_rec_1_100_data17_1242442967-459473_analysis_H1L1V1_merge_result.json,17,57.220967117978944,42.63032180060691,-2455.003703568025,-2447.1803757027783,7.823327865246483,-14.590645317372037
18,/home1/srashti.goyal/tgr-lensing/codes/S190521g_bilby_pipe/background/GR_rec_09092022/final_result/GRinj_GR_rec_1_100_data18_1242442967-459473_analysis_H1L1V1_merge_result.json,/home1/srashti.goyal/tgr-lensing/codes/S190521g_bilby_pipe/background/nGR_rec_09092022/final_result/GRinj_nGR_rec_1_100_data18_1242442967-459473_analysis_H1L1V1_merge_result.json,18,54.373643834669565,73.37534843218327,-2544.7582662732398,-2511.291968284961,33.46629798827871,19.001704597513708
19,/home1/srashti.goyal/tgr-lensing/codes/S190521g_bilby_pipe/background/GR_rec_09092022/final_result/GRinj_GR_rec_1_100_data19_1242442967-459473_analysis_H1L1V1_merge_result.json,/home1/srashti.goyal/tgr-lensing/codes/S190521g_bilby_pipe/background/nGR_rec_09092022/final_result/GRinj_nGR_rec_1_100_data19_1242442967-459473_analysis_H1L1V1_merge_result.json,19,44.57126046092026,54.52373976221861,-2498.0995707521624,-2464.314934587253,33.78463616490944,9.952479301298354
20,/home1/srashti.goyal/tgr-lensing/codes/S190521g_bilby_pipe/background/GR_rec_09092022/final_result/GRinj_GR_rec_1_100_data20_1242442967-459473_analysis_H1L1V1_merge_result.json,/home1/srashti.goyal/tgr-lensing/codes/S190521g_bilby_pipe/background/nGR_rec_09092022/final_result/GRinj_nGR_rec_1_100_data20_1242442967-459473_analysis_H1L1V1_merge_result.json,20,49.789515128835774,46.64884574862117,-2574.2752006577216,-2518.589083840333,55.686116817388665,-3.1406693802146037
21,/home1/srashti.goyal/tgr-lensing/codes/S190521g_bilby_pipe/background/GR_rec_09092022/final_result/GRinj_GR_rec_1_100_data21_1242442967-459473_analysis_H1L1V1_merge_result.json,/home1/srashti.goyal/tgr-lensing/codes/S190521g_bilby_pipe/background/nGR_rec_09092022/final_result/GRinj_nGR_rec_1_100_data21_1242442967-459473_analysis_H1L1V1_merge_result.json,21,54.99401331266472,67.9415814313711,-2444.9470003240162,-2373.646927110422,71.30007321359426,12.947568118706386
22,/home1/srashti.goyal/tgr-lensing/codes/S190521g_bilby_pipe/background/GR_rec_09092022/final_result/GRinj_GR_rec_1_100_data22_1242442967-459473_analysis_H1L1V1_merge_result.json,/home1/srashti.goyal/tgr-lensing/codes/S190521g_bilby_pipe/background/nGR_rec_09092022/final_result/GRinj_nGR_rec_1_100_data22_1242442967-459473_analysis_H1L1V1_merge_result.json,22,41.835763512672656,57.723504645788125,-2456.4798760067806,-2461.3361094189104,-4.856233412129768,15.887741133115469
23,/home1/srashti.goyal/tgr-lensing/codes/S190521g_bilby_pipe/background/GR_rec_09092022/final_result/GRinj_GR_rec_1_100_data23_1242442967-459473_analysis_H1L1V1_merge_result.json,/home1/srashti.goyal/tgr-lensing/codes/S190521g_bilby_pipe/background/nGR_rec_09092022/final_result/GRinj_nGR_rec_1_100_data23_1242442967-459473_analysis_H1L1V1_merge_result.json,23,60.38325594532989,50.600762189532816,-2471.553848927086,-2444.1235194637434,27.430329463342787,-9.782493755797077
24,/home1/srashti.goyal/tgr-lensing/codes/S190521g_bilby_pipe/background/GR_rec_09092022/final_result/GRinj_GR_rec_1_100_data24_1242442967-459473_analysis_H1L1V1_merge_result.json,/home1/srashti.goyal/tgr-lensing/codes/S190521g_bilby_pipe/background/nGR_rec_09092022/final_result/GRinj_nGR_rec_1_100_data24_1242442967-459473_analysis_H1L1V1_merge_result.json,24,40.60398163305899,59.79639126834854,-2450.8844341685817,-2432.898443865534,17.985990303047856,19.19240963528955
25,/home1/srashti.goyal/tgr-lensing/codes/S190521g_bilby_pipe/background/GR_rec_09092022/final_result/GRinj_GR_rec_1_100_data25_1242442967-459473_analysis_H1L1V1_merge_result.json,/home1/srashti.goyal/tgr-lensing/codes/S190521g_bilby_pipe/background/nGR_rec_09092022/final_result/GRinj_nGR_rec_1_100_data25_1242442967-459473_analysis_H1L1V1_merge_result.json,25,86.8521336821791,68.34600573783064,-2457.2933572419024,-2463.425276569159,-6.131919327256583,-18.506127944348464
26,/home1/srashti.goyal/tgr-lensing/codes/S190521g_bilby_pipe/background/GR_rec_09092022/final_result/GRinj_GR_rec_1_100_data26_1242442967-459473_analysis_H1L1V1_merge_result.json,/home1/srashti.goyal/tgr-lensing/codes/S190521g_bilby_pipe/background/nGR_rec_09092022/final_result/GRinj_nGR_rec_1_100_data26_1242442967-459473_analysis_H1L1V1_merge_result.json,26,72.09671982508144,50.85169196252764,-2445.243008269391,-2420.5819801286766,24.66102814071428,-21.245027862553798
27,/home1/srashti.goyal/tgr-lensing/codes/S190521g_bilby_pipe/background/GR_rec_09092022/final_result/GRinj_GR_rec_1_100_data27_1242442967-459473_analysis_H1L1V1_merge_result.json,/home1/srashti.goyal/tgr-lensing/codes/S190521g_bilby_pipe/background/nGR_rec_09092022/final_result/GRinj_nGR_rec_1_100_data27_1242442967-459473_analysis_H1L1V1_merge_result.json,27,45.469026799104995,34.49236650883449,-2428.404923322374,-2466.0095647375924,-37.60464141521834,-10.976660290270502
28,/home1/srashti.goyal/tgr-lensing/codes/S190521g_bilby_pipe/background/GR_rec_09092022/final_result/GRinj_GR_rec_1_100_data28_1242442967-459473_analysis_H1L1V1_merge_result.json,/home1/srashti.goyal/tgr-lensing/codes/S190521g_bilby_pipe/background/nGR_rec_09092022/final_result/GRinj_nGR_rec_1_100_data28_1242442967-459473_analysis_H1L1V1_merge_result.json,28,64.37311222432254,69.58170849833596,-2473.7033258914025,-2460.344193592687,13.359132298715394,5.208596274013416
29,/home1/srashti.goyal/tgr-lensing/codes/S190521g_bilby_pipe/background/GR_rec_09092022/final_result/GRinj_GR_rec_1_100_data29_1242442967-459473_analysis_H1L1V1_merge_result.json,/home1/srashti.goyal/tgr-lensing/codes/S190521g_bilby_pipe/background/nGR_rec_09092022/final_result/GRinj_nGR_rec_1_100_data29_1242442967-459473_analysis_H1L1V1_merge_result.json,29,80.35958906713722,61.85701489022222,-2439.4043914925746,-2537.7613451414886,-98.35695364891399,-18.502574176915005
30,/home1/srashti.goyal/tgr-lensing/codes/S190521g_bilby_pipe/background/GR_rec_09092022/final_result/GRinj_GR_rec_1_100_data30_1242442967-459473_analysis_H1L1V1_merge_result.json,/home1/srashti.goyal/tgr-lensing/codes/S190521g_bilby_pipe/background/nGR_rec_09092022/final_result/GRinj_nGR_rec_1_100_data30_1242442967-459473_analysis_H1L1V1_merge_result.json,30,55.81786775936416,59.48677011317477,-2441.642641411573,-2402.3754930229748,39.26714838859834,3.6689023538106085
31,/home1/srashti.goyal/tgr-lensing/codes/S190521g_bilby_pipe/background/GR_rec_09092022/final_result/GRinj_GR_rec_1_100_data31_1242442967-459473_analysis_H1L1V1_merge_result.json,/home1/srashti.goyal/tgr-lensing/codes/S190521g_bilby_pipe/background/nGR_rec_09092022/final_result/GRinj_nGR_rec_1_100_data31_1242442967-459473_analysis_H1L1V1_merge_result.json,31,84.66445527948781,77.67999458781969,-2520.6227693538794,-2410.8148712760944,109.80789807778501,-6.984460691668119
32,/home1/srashti.goyal/tgr-lensing/codes/S190521g_bilby_pipe/background/GR_rec_09092022/final_result/GRinj_GR_rec_1_100_data32_1242442967-459473_analysis_H1L1V1_merge_result.json,/home1/srashti.goyal/tgr-lensing/codes/S190521g_bilby_pipe/background/nGR_rec_09092022/final_result/GRinj_nGR_rec_1_100_data32_1242442967-459473_analysis_H1L1V1_merge_result.json,32,49.56206764959461,69.114950828784,-2412.962410874253,-2438.004925929685,-25.042515055432432,19.552883179189394
33,/home1/srashti.goyal/tgr-lensing/codes/S190521g_bilby_pipe/background/GR_rec_09092022/final_result/GRinj_GR_rec_1_100_data33_1242442967-459473_analysis_H1L1V1_merge_result.json,/home1/srashti.goyal/tgr-lensing/codes/S190521g_bilby_pipe/background/nGR_rec_09092022/final_result/GRinj_nGR_rec_1_100_data33_1242442967-459473_analysis_H1L1V1_merge_result.json,33,59.61138532999712,41.65789650164379,-2427.7521050600244,-2506.572349799466,-78.82024473944148,-17.95348882835333
34,/home1/srashti.goyal/tgr-lensing/codes/S190521g_bilby_pipe/background/GR_rec_09092022/final_result/GRinj_GR_rec_1_100_data34_1242442967-459473_analysis_H1L1V1_merge_result.json,/home1/srashti.goyal/tgr-lensing/codes/S190521g_bilby_pipe/background/nGR_rec_09092022/final_result/GRinj_nGR_rec_1_100_data34_1242442967-459473_analysis_H1L1V1_merge_result.json,34,62.14868017640265,52.55034210831627,-2467.8303360221657,-2476.7999670019753,-8.969630979809608,-9.598338068086377
35,/home1/srashti.goyal/tgr-lensing/codes/S190521g_bilby_pipe/background/GR_rec_09092022/final_result/GRinj_GR_rec_1_100_data35_1242442967-459473_analysis_H1L1V1_merge_result.json,/home1/srashti.goyal/tgr-lensing/codes/S190521g_bilby_pipe/background/nGR_rec_09092022/final_result/GRinj_nGR_rec_1_100_data35_1242442967-459473_analysis_H1L1V1_merge_result.json,35,100.92660809443714,49.123483038608356,-2465.9893848047946,-2416.80583583341,49.183548971384425,-51.80312505582879
36,/home1/srashti.goyal/tgr-lensing/codes/S190521g_bilby_pipe/background/GR_rec_09092022/final_result/GRinj_GR_rec_1_100_data36_1242442967-459473_analysis_H1L1V1_merge_result.json,/home1/srashti.goyal/tgr-lensing/codes/S190521g_bilby_pipe/background/nGR_rec_09092022/final_result/GRinj_nGR_rec_1_100_data36_1242442967-459473_analysis_H1L1V1_merge_result.json,36,63.00240968058415,88.70652340630204,-2395.6252821039243,-2439.542504839079,-43.91722273515461,25.70411372571789
37,/home1/srashti.goyal/tgr-lensing/codes/S190521g_bilby_pipe/background/GR_rec_09092022/final_result/GRinj_GR_rec_1_100_data37_1242442967-459473_analysis_H1L1V1_merge_result.json,/home1/srashti.goyal/tgr-lensing/codes/S190521g_bilby_pipe/background/nGR_rec_09092022/final_result/GRinj_nGR_rec_1_100_data37_1242442967-459473_analysis_H1L1V1_merge_result.json,37,83.06268195314306,57.5562241797229,-2531.914061580923,-2428.08490747031,103.82915411061276,-25.506457773420152
38,/home1/srashti.goyal/tgr-lensing/codes/S190521g_bilby_pipe/background/GR_rec_09092022/final_result/GRinj_GR_rec_1_100_data38_1242442967-459473_analysis_H1L1V1_merge_result.json,/home1/srashti.goyal/tgr-lensing/codes/S190521g_bilby_pipe/background/nGR_rec_09092022/final_result/GRinj_nGR_rec_1_100_data38_1242442967-459473_analysis_H1L1V1_merge_result.json,38,61.58906387589968,44.22961777346836,-2523.045313655468,-2531.787482666758,-8.742169011290116,-17.35944610243132
39,/home1/srashti.goyal/tgr-lensing/codes/S190521g_bilby_pipe/background/GR_rec_09092022/final_result/GRinj_GR_rec_1_100_data39_1242442967-459473_analysis_H1L1V1_merge_result.json,/home1/srashti.goyal/tgr-lensing/codes/S190521g_bilby_pipe/background/nGR_rec_09092022/final_result/GRinj_nGR_rec_1_100_data39_1242442967-459473_analysis_H1L1V1_merge_result.json,39,65.6915581332064,76.82289357556465,-2438.7753361188425,-2487.400331663522,-48.62499554467968,11.13133544235825
40,/home1/srashti.goyal/tgr-lensing/codes/S190521g_bilby_pipe/background/GR_rec_09092022/final_result/GRinj_GR_rec_1_100_data40_1242442967-459473_analysis_H1L1V1_merge_result.json,/home1/srashti.goyal/tgr-lensing/codes/S190521g_bilby_pipe/background/nGR_rec_09092022/final_result/GRinj_nGR_rec_1_100_data40_1242442967-459473_analysis_H1L1V1_merge_result.json,40,69.8914167961193,59.074076830765534,-2494.7201716157488,-2447.987331679302,46.73283993644691,-10.817339965353767
41,/home1/srashti.goyal/tgr-lensing/codes/S190521g_bilby_pipe/background/GR_rec_09092022/final_result/GRinj_GR_rec_1_100_data41_1242442967-459473_analysis_H1L1V1_merge_result.json,/home1/srashti.goyal/tgr-lensing/codes/S190521g_bilby_pipe/background/nGR_rec_09092022/final_result/GRinj_nGR_rec_1_100_data41_1242442967-459473_analysis_H1L1V1_merge_result.json,41,76.45050797931935,65.90032533880367,-2536.336787393286,-2451.185465766024,85.15132162726195,-10.550182640515686
42,/home1/srashti.goyal/tgr-lensing/codes/S190521g_bilby_pipe/background/GR_rec_09092022/final_result/GRinj_GR_rec_1_100_data42_1242442967-459473_analysis_H1L1V1_merge_result.json,/home1/srashti.goyal/tgr-lensing/codes/S190521g_bilby_pipe/background/nGR_rec_09092022/final_result/GRinj_nGR_rec_1_100_data42_1242442967-459473_analysis_H1L1V1_merge_result.json,42,103.63630561241598,59.91331048182201,-2529.631264207024,-2484.566273357742,45.06499084928191,-43.72299513059397
43,/home1/srashti.goyal/tgr-lensing/codes/S190521g_bilby_pipe/background/GR_rec_09092022/final_result/GRinj_GR_rec_1_100_data43_1242442967-459473_analysis_H1L1V1_merge_result.json,/home1/srashti.goyal/tgr-lensing/codes/S190521g_bilby_pipe/background/nGR_rec_09092022/final_result/GRinj_nGR_rec_1_100_data43_1242442967-459473_analysis_H1L1V1_merge_result.json,43,74.52116175442143,80.11320950564414,-2470.188224533474,-2523.721538936827,-53.53331440335296,5.592047751222708
44,/home1/srashti.goyal/tgr-lensing/codes/S190521g_bilby_pipe/background/GR_rec_09092022/final_result/GRinj_GR_rec_1_100_data44_1242442967-459473_analysis_H1L1V1_merge_result.json,/home1/srashti.goyal/tgr-lensing/codes/S190521g_bilby_pipe/background/nGR_rec_09092022/final_result/GRinj_nGR_rec_1_100_data44_1242442967-459473_analysis_H1L1V1_merge_result.json,44,35.3541177851107,52.840283386496594,-2551.0287600616607,-2486.2662820658697,64.76247799579096,17.486165601385892
45,/home1/srashti.goyal/tgr-lensing/codes/S190521g_bilby_pipe/background/GR_rec_09092022/final_result/GRinj_GR_rec_1_100_data45_1242442967-459473_analysis_H1L1V1_merge_result.json,/home1/srashti.goyal/tgr-lensing/codes/S190521g_bilby_pipe/background/nGR_rec_09092022/final_result/GRinj_nGR_rec_1_100_data45_1242442967-459473_analysis_H1L1V1_merge_result.json,45,62.256672178386,70.7782998432267,-2453.305684617429,-2458.4450566357928,-5.1393720183637015,8.521627664840707
46,/home1/srashti.goyal/tgr-lensing/codes/S190521g_bilby_pipe/background/GR_rec_09092022/final_result/GRinj_GR_rec_1_100_data46_1242442967-459473_analysis_H1L1V1_merge_result.json,/home1/srashti.goyal/tgr-lensing/codes/S190521g_bilby_pipe/background/nGR_rec_09092022/final_result/GRinj_nGR_rec_1_100_data46_1242442967-459473_analysis_H1L1V1_merge_result.json,46,60.33865551108511,78.17377839406117,-2415.164102647528,-2473.5810673540127,-58.41696470648458,17.835122882976066
47,/home1/srashti.goyal/tgr-lensing/codes/S190521g_bilby_pipe/background/GR_rec_09092022/final_result/GRinj_GR_rec_1_100_data47_1242442967-459473_analysis_H1L1V1_merge_result.json,/home1/srashti.goyal/tgr-lensing/codes/S190521g_bilby_pipe/background/nGR_rec_09092022/final_result/GRinj_nGR_rec_1_100_data47_1242442967-459473_analysis_H1L1V1_merge_result.json,47,60.63622513863538,52.589411324350294,-2418.747983669027,-2511.4314118849816,-92.68342821595479,-8.046813814285088
48,/home1/srashti.goyal/tgr-lensing/codes/S190521g_bilby_pipe/background/GR_rec_09092022/final_result/GRinj_GR_rec_1_100_data48_1242442967-459473_analysis_H1L1V1_merge_result.json,/home1/srashti.goyal/tgr-lensing/codes/S190521g_bilby_pipe/background/nGR_rec_09092022/final_result/GRinj_nGR_rec_1_100_data48_1242442967-459473_analysis_H1L1V1_merge_result.json,48,45.798541150310484,61.277371969517844,-2421.455199164676,-2413.254167397832,8.201031766843698,15.47883081920736
49,/home1/srashti.goyal/tgr-lensing/codes/S190521g_bilby_pipe/background/GR_rec_09092022/final_result/GRinj_GR_rec_1_100_data49_1242442967-459473_analysis_H1L1V1_merge_result.json,/home1/srashti.goyal/tgr-lensing/codes/S190521g_bilby_pipe/background/nGR_rec_09092022/final_result/GRinj_nGR_rec_1_100_data49_1242442967-459473_analysis_H1L1V1_merge_result.json,49,64.80739056328503,48.62174583894557,-2478.316829130013,-2446.782012610378,31.534816519635115,-16.185644724339454
50,/home1/srashti.goyal/tgr-lensing/codes/S190521g_bilby_pipe/background/GR_rec_09092022/final_result/GRinj_GR_rec_1_100_data50_1242442967-459473_analysis_H1L1V1_merge_result.json,/home1/srashti.goyal/tgr-lensing/codes/S190521g_bilby_pipe/background/nGR_rec_09092022/final_result/GRinj_nGR_rec_1_100_data50_1242442967-459473_analysis_H1L1V1_merge_result.json,50,44.794271349991504,64.47565907853595,-2358.6683766241686,-2445.824970955068,-87.15659433089922,19.68138772854445
51,/home1/srashti.goyal/tgr-lensing/codes/S190521g_bilby_pipe/background/GR_rec_09092022/final_result/GRinj_GR_rec_1_100_data51_1242442967-459473_analysis_H1L1V1_merge_result.json,/home1/srashti.goyal/tgr-lensing/codes/S190521g_bilby_pipe/background/nGR_rec_09092022/final_result/GRinj_nGR_rec_1_100_data51_1242442967-459473_analysis_H1L1V1_merge_result.json,51,72.75863674968059,74.5502961386128,-2509.612056906637,-2483.7082113429587,25.90384556367826,1.791659388932203
52,/home1/srashti.goyal/tgr-lensing/codes/S190521g_bilby_pipe/background/GR_rec_09092022/final_result/GRinj_GR_rec_1_100_data52_1242442967-459473_analysis_H1L1V1_merge_result.json,/home1/srashti.goyal/tgr-lensing/codes/S190521g_bilby_pipe/background/nGR_rec_09092022/final_result/GRinj_nGR_rec_1_100_data52_1242442967-459473_analysis_H1L1V1_merge_result.json,52,80.39214003363531,67.83247649827399,-2481.096186687497,-2525.6858865146,-44.58969982710323,-12.559663535361324
53,/home1/srashti.goyal/tgr-lensing/codes/S190521g_bilby_pipe/background/GR_rec_09092022/final_result/GRinj_GR_rec_1_100_data53_1242442967-459473_analysis_H1L1V1_merge_result.json,/home1/srashti.goyal/tgr-lensing/codes/S190521g_bilby_pipe/background/nGR_rec_09092022/final_result/GRinj_nGR_rec_1_100_data53_1242442967-459473_analysis_H1L1V1_merge_result.json,53,66.41816570448918,52.70698095384887,-2454.6950325449675,-2416.7822037010083,37.91282884395923,-13.711184750640314
54,/home1/srashti.goyal/tgr-lensing/codes/S190521g_bilby_pipe/background/GR_rec_09092022/final_result/GRinj_GR_rec_1_100_data54_1242442967-459473_analysis_H1L1V1_merge_result.json,/home1/srashti.goyal/tgr-lensing/codes/S190521g_bilby_pipe/background/nGR_rec_09092022/final_result/GRinj_nGR_rec_1_100_data54_1242442967-459473_analysis_H1L1V1_merge_result.json,54,61.69942175179676,74.0326139177937,-2607.994908522808,-2527.1288937640975,80.86601475871066,12.333192165996934
55,/home1/srashti.goyal/tgr-lensing/codes/S190521g_bilby_pipe/background/GR_rec_09092022/final_result/GRinj_GR_rec_1_100_data55_1242442967-459473_analysis_H1L1V1_merge_result.json,/home1/srashti.goyal/tgr-lensing/codes/S190521g_bilby_pipe/background/nGR_rec_09092022/final_result/GRinj_nGR_rec_1_100_data55_1242442967-459473_analysis_H1L1V1_merge_result.json,55,84.20621002367716,66.96589200422477,-2447.457630153768,-2491.2504478131627,-43.792817659394586,-17.24031801945239
56,/home1/srashti.goyal/tgr-lensing/codes/S190521g_bilby_pipe/background/GR_rec_09092022/final_result/GRinj_GR_rec_1_100_data56_1242442967-459473_analysis_H1L1V1_merge_result.json,/home1/srashti.goyal/tgr-lensing/codes/S190521g_bilby_pipe/background/nGR_rec_09092022/final_result/GRinj_nGR_rec_1_100_data56_1242442967-459473_analysis_H1L1V1_merge_result.json,56,51.53017317918466,38.8670037091897,-2462.4116602141717,-2467.9487752941995,-5.537115080027888,-12.663169469994955
57,/home1/srashti.goyal/tgr-lensing/codes/S190521g_bilby_pipe/background/GR_rec_09092022/final_result/GRinj_GR_rec_1_100_data57_1242442967-459473_analysis_H1L1V1_merge_result.json,/home1/srashti.goyal/tgr-lensing/codes/S190521g_bilby_pipe/background/nGR_rec_09092022/final_result/GRinj_nGR_rec_1_100_data57_1242442967-459473_analysis_H1L1V1_merge_result.json,57,73.39397830313783,72.82512868249705,-2419.571427878803,-2596.942886891722,-177.37145901291888,-0.5688496206407763
58,/home1/srashti.goyal/tgr-lensing/codes/S190521g_bilby_pipe/background/GR_rec_09092022/final_result/GRinj_GR_rec_1_100_data58_1242442967-459473_analysis_H1L1V1_merge_result.json,/home1/srashti.goyal/tgr-lensing/codes/S190521g_bilby_pipe/background/nGR_rec_09092022/final_result/GRinj_nGR_rec_1_100_data58_1242442967-459473_analysis_H1L1V1_merge_result.json,58,79.92980329726788,66.03785382507112,-2448.040014619992,-2568.8184441402714,-120.77842952027959,-13.891949472196757
59,/home1/srashti.goyal/tgr-lensing/codes/S190521g_bilby_pipe/background/GR_rec_09092022/final_result/GRinj_GR_rec_1_100_data59_1242442967-459473_analysis_H1L1V1_merge_result.json,/home1/srashti.goyal/tgr-lensing/codes/S190521g_bilby_pipe/background/nGR_rec_09092022/final_result/GRinj_nGR_rec_1_100_data59_1242442967-459473_analysis_H1L1V1_merge_result.json,59,71.22343588036028,88.28368217266552,-2478.9184216776252,-2445.3325810751644,33.58584060246085,17.060246292305237
60,/home1/srashti.goyal/tgr-lensing/codes/S190521g_bilby_pipe/background/GR_rec_09092022/final_result/GRinj_GR_rec_1_100_data60_1242442967-459473_analysis_H1L1V1_merge_result.json,/home1/srashti.goyal/tgr-lensing/codes/S190521g_bilby_pipe/background/nGR_rec_09092022/final_result/GRinj_nGR_rec_1_100_data60_1242442967-459473_analysis_H1L1V1_merge_result.json,60,102.23480361988868,97.17242222944606,-2530.6975930272365,-2387.7553016775205,142.94229134971602,-5.062381390442624
61,/home1/srashti.goyal/tgr-lensing/codes/S190521g_bilby_pipe/background/GR_rec_09092022/final_result/GRinj_GR_rec_1_100_data61_1242442967-459473_analysis_H1L1V1_merge_result.json,/home1/srashti.goyal/tgr-lensing/codes/S190521g_bilby_pipe/background/nGR_rec_09092022/final_result/GRinj_nGR_rec_1_100_data61_1242442967-459473_analysis_H1L1V1_merge_result.json,61,90.40229058730938,99.88654744383894,-2482.800773223742,-2421.650575319798,61.15019790394399,9.484256856529555
62,/home1/srashti.goyal/tgr-lensing/codes/S190521g_bilby_pipe/background/GR_rec_09092022/final_result/GRinj_GR_rec_1_100_data62_1242442967-459473_analysis_H1L1V1_merge_result.json,/home1/srashti.goyal/tgr-lensing/codes/S190521g_bilby_pipe/background/nGR_rec_09092022/final_result/GRinj_nGR_rec_1_100_data62_1242442967-459473_analysis_H1L1V1_merge_result.json,62,75.51327986622982,86.29779453963101,-2392.4746465372664,-2498.7047710378015,-106.23012450053511,10.78451467340119
63,/home1/srashti.goyal/tgr-lensing/codes/S190521g_bilby_pipe/background/GR_rec_09092022/final_result/GRinj_GR_rec_1_100_data63_1242442967-459473_analysis_H1L1V1_merge_result.json,/home1/srashti.goyal/tgr-lensing/codes/S190521g_bilby_pipe/background/nGR_rec_09092022/final_result/GRinj_nGR_rec_1_100_data63_1242442967-459473_analysis_H1L1V1_merge_result.json,63,46.81118596944589,40.979962989419164,-2394.71793607322,-2526.7034921878153,-131.9855561145955,-5.831222980026723
64,/home1/srashti.goyal/tgr-lensing/codes/S190521g_bilby_pipe/background/GR_rec_09092022/final_result/GRinj_GR_rec_1_100_data64_1242442967-459473_analysis_H1L1V1_merge_result.json,/home1/srashti.goyal/tgr-lensing/codes/S190521g_bilby_pipe/background/nGR_rec_09092022/final_result/GRinj_nGR_rec_1_100_data64_1242442967-459473_analysis_H1L1V1_merge_result.json,64,55.86128877402871,73.4458015657874,-2431.135586510409,-2492.13717854605,-61.0015920356409,17.584512791758698
65,/home1/srashti.goyal/tgr-lensing/codes/S190521g_bilby_pipe/background/GR_rec_09092022/final_result/GRinj_GR_rec_1_100_data65_1242442967-459473_analysis_H1L1V1_merge_result.json,/home1/srashti.goyal/tgr-lensing/codes/S190521g_bilby_pipe/background/nGR_rec_09092022/final_result/GRinj_nGR_rec_1_100_data65_1242442967-459473_analysis_H1L1V1_merge_result.json,65,72.22736483570134,84.63234790744855,-2537.2219615018594,-2460.91183880999,76.31012269186931,12.40498307174721
66,/home1/srashti.goyal/tgr-lensing/codes/S190521g_bilby_pipe/background/GR_rec_09092022/final_result/GRinj_GR_rec_1_100_data66_1242442967-459473_analysis_H1L1V1_merge_result.json,/home1/srashti.goyal/tgr-lensing/codes/S190521g_bilby_pipe/background/nGR_rec_09092022/final_result/GRinj_nGR_rec_1_100_data66_1242442967-459473_analysis_H1L1V1_merge_result.json,66,44.61118398319786,75.20739167883903,-2478.30959556238,-2462.6419354921404,15.667660070239435,30.59620769564117
67,/home1/srashti.goyal/tgr-lensing/codes/S190521g_bilby_pipe/background/GR_rec_09092022/final_result/GRinj_GR_rec_1_100_data67_1242442967-459473_analysis_H1L1V1_merge_result.json,/home1/srashti.goyal/tgr-lensing/codes/S190521g_bilby_pipe/background/nGR_rec_09092022/final_result/GRinj_nGR_rec_1_100_data67_1242442967-459473_analysis_H1L1V1_merge_result.json,67,78.51228249979886,79.12006761046814,-2631.724738497026,-2534.0201894340225,97.70454906300347,0.6077851106692833
68,/home1/srashti.goyal/tgr-lensing/codes/S190521g_bilby_pipe/background/GR_rec_09092022/final_result/GRinj_GR_rec_1_100_data68_1242442967-459473_analysis_H1L1V1_merge_result.json,/home1/srashti.goyal/tgr-lensing/codes/S190521g_bilby_pipe/background/nGR_rec_09092022/final_result/GRinj_nGR_rec_1_100_data68_1242442967-459473_analysis_H1L1V1_merge_result.json,68,42.06472509202695,47.84758555811004,-2462.6245895675133,-2427.2778708830983,35.34671868441501,5.782860466083093
69,/home1/srashti.goyal/tgr-lensing/codes/S190521g_bilby_pipe/background/GR_rec_09092022/final_result/GRinj_GR_rec_1_100_data69_1242442967-459473_analysis_H1L1V1_merge_result.json,/home1/srashti.goyal/tgr-lensing/codes/S190521g_bilby_pipe/background/nGR_rec_09092022/final_result/GRinj_nGR_rec_1_100_data69_1242442967-459473_analysis_H1L1V1_merge_result.json,69,44.36099771670342,45.36097286085533,-2400.8875558694644,-2500.7155813783324,-99.828025508868,0.9999751441519038
70,/home1/srashti.goyal/tgr-lensing/codes/S190521g_bilby_pipe/background/GR_rec_09092022/final_result/GRinj_GR_rec_1_100_data70_1242442967-459473_analysis_H1L1V1_merge_result.json,/home1/srashti.goyal/tgr-lensing/codes/S190521g_bilby_pipe/background/nGR_rec_09092022/final_result/GRinj_nGR_rec_1_100_data70_1242442967-459473_analysis_H1L1V1_merge_result.json,70,57.56743353252068,66.25315903657201,-2471.9070481980043,-2497.1801289906416,-25.273080792637302,8.685725504051334
71,/home1/srashti.goyal/tgr-lensing/codes/S190521g_bilby_pipe/background/GR_rec_09092022/final_result/GRinj_GR_rec_1_100_data71_1242442967-459473_analysis_H1L1V1_merge_result.json,/home1/srashti.goyal/tgr-lensing/codes/S190521g_bilby_pipe/background/nGR_rec_09092022/final_result/GRinj_nGR_rec_1_100_data71_1242442967-459473_analysis_H1L1V1_merge_result.json,71,43.99570883606157,65.10167627476994,-2513.2499102666816,-2443.7644533866624,69.48545688001923,21.105967438708376
72,/home1/srashti.goyal/tgr-lensing/codes/S190521g_bilby_pipe/background/GR_rec_09092022/final_result/GRinj_GR_rec_1_100_data72_1242442967-459473_analysis_H1L1V1_merge_result.json,/home1/srashti.goyal/tgr-lensing/codes/S190521g_bilby_pipe/background/nGR_rec_09092022/final_result/GRinj_nGR_rec_1_100_data72_1242442967-459473_analysis_H1L1V1_merge_result.json,72,82.61374133205936,61.386500407040785,-2483.5487289158286,-2409.761673012556,73.78705590327263,-21.227240925018577
73,/home1/srashti.goyal/tgr-lensing/codes/S190521g_bilby_pipe/background/GR_rec_09092022/final_result/GRinj_GR_rec_1_100_data73_1242442967-459473_analysis_H1L1V1_merge_result.json,/home1/srashti.goyal/tgr-lensing/codes/S190521g_bilby_pipe/background/nGR_rec_09092022/final_result/GRinj_nGR_rec_1_100_data73_1242442967-459473_analysis_H1L1V1_merge_result.json,73,51.68292205386115,50.05029904957519,-2445.943765018952,-2493.134991682345,-47.19122666339308,-1.6326230042859606
74,/home1/srashti.goyal/tgr-lensing/codes/S190521g_bilby_pipe/background/GR_rec_09092022/final_result/GRinj_GR_rec_1_100_data74_1242442967-459473_analysis_H1L1V1_merge_result.json,/home1/srashti.goyal/tgr-lensing/codes/S190521g_bilby_pipe/background/nGR_rec_09092022/final_result/GRinj_nGR_rec_1_100_data74_1242442967-459473_analysis_H1L1V1_merge_result.json,74,58.94516315978035,57.00045175890591,-2507.570428001838,-2521.786360741071,-14.215932739232812,-1.9447114008744393
75,/home1/srashti.goyal/tgr-lensing/codes/S190521g_bilby_pipe/background/GR_rec_09092022/final_result/GRinj_GR_rec_1_100_data75_1242442967-459473_analysis_H1L1V1_merge_result.json,/home1/srashti.goyal/tgr-lensing/codes/S190521g_bilby_pipe/background/nGR_rec_09092022/final_result/GRinj_nGR_rec_1_100_data75_1242442967-459473_analysis_H1L1V1_merge_result.json,75,58.083464549039945,62.517752119802935,-2502.5965256737627,-2487.3247733316557,15.271752342106993,4.43428757076299
76,/home1/srashti.goyal/tgr-lensing/codes/S190521g_bilby_pipe/background/GR_rec_09092022/final_result/GRinj_GR_rec_1_100_data76_1242442967-459473_analysis_H1L1V1_merge_result.json,/home1/srashti.goyal/tgr-lensing/codes/S190521g_bilby_pipe/background/nGR_rec_09092022/final_result/GRinj_nGR_rec_1_100_data76_1242442967-459473_analysis_H1L1V1_merge_result.json,76,51.44576777207294,67.31031281883133,-2500.567229103634,-2424.921813948986,75.64541515464816,15.864545046758394
77,/home1/srashti.goyal/tgr-lensing/codes/S190521g_bilby_pipe/background/GR_rec_09092022/final_result/GRinj_GR_rec_1_100_data77_1242442967-459473_analysis_H1L1V1_merge_result.json,/home1/srashti.goyal/tgr-lensing/codes/S190521g_bilby_pipe/background/nGR_rec_09092022/final_result/GRinj_nGR_rec_1_100_data77_1242442967-459473_analysis_H1L1V1_merge_result.json,77,85.86878185356318,89.97586804231423,-2365.3307002659335,-2480.0851534179537,-114.75445315202023,4.107086188751055
78,/home1/srashti.goyal/tgr-lensing/codes/S190521g_bilby_pipe/background/GR_rec_09092022/final_result/GRinj_GR_rec_1_100_data78_1242442967-459473_analysis_H1L1V1_merge_result.json,/home1/srashti.goyal/tgr-lensing/codes/S190521g_bilby_pipe/background/nGR_rec_09092022/final_result/GRinj_nGR_rec_1_100_data78_1242442967-459473_analysis_H1L1V1_merge_result.json,78,88.94307631707534,65.33716925631597,-2572.771000970606,-2459.07644413436,113.69455683624619,-23.605907060759364
79,/home1/srashti.goyal/tgr-lensing/codes/S190521g_bilby_pipe/background/GR_rec_09092022/final_result/GRinj_GR_rec_1_100_data79_1242442967-459473_analysis_H1L1V1_merge_result.json,/home1/srashti.goyal/tgr-lensing/codes/S190521g_bilby_pipe/background/nGR_rec_09092022/final_result/GRinj_nGR_rec_1_100_data79_1242442967-459473_analysis_H1L1V1_merge_result.json,79,71.97302032323523,61.58370848071672,-2542.1240281430214,-2530.7403070154514,11.38372112756997,-10.38931184251851
80,/home1/srashti.goyal/tgr-lensing/codes/S190521g_bilby_pipe/background/GR_rec_09092022/final_result/GRinj_GR_rec_1_100_data80_1242442967-459473_analysis_H1L1V1_merge_result.json,/home1/srashti.goyal/tgr-lensing/codes/S190521g_bilby_pipe/background/nGR_rec_09092022/final_result/GRinj_nGR_rec_1_100_data80_1242442967-459473_analysis_H1L1V1_merge_result.json,80,49.109127003325284,53.8033486546251,-2540.4754787474817,-2573.430606561021,-32.95512781353909,4.694221651299813
81,/home1/srashti.goyal/tgr-lensing/codes/S190521g_bilby_pipe/background/GR_rec_09092022/final_result/GRinj_GR_rec_1_100_data81_1242442967-459473_analysis_H1L1V1_merge_result.json,/home1/srashti.goyal/tgr-lensing/codes/S190521g_bilby_pipe/background/nGR_rec_09092022/final_result/GRinj_nGR_rec_1_100_data81_1242442967-459473_analysis_H1L1V1_merge_result.json,81,53.48313922027046,49.83989279902062,-2487.668133808906,-2411.6831061491703,75.9850276597358,-3.6432464212498417
82,/home1/srashti.goyal/tgr-lensing/codes/S190521g_bilby_pipe/background/GR_rec_09092022/final_result/GRinj_GR_rec_1_100_data82_1242442967-459473_analysis_H1L1V1_merge_result.json,/home1/srashti.goyal/tgr-lensing/codes/S190521g_bilby_pipe/background/nGR_rec_09092022/final_result/GRinj_nGR_rec_1_100_data82_1242442967-459473_analysis_H1L1V1_merge_result.json,82,69.01420884298659,63.290311354820915,-2555.3096371102747,-2515.5928537698132,39.71678334046146,-5.723897488165676
83,/home1/srashti.goyal/tgr-lensing/codes/S190521g_bilby_pipe/background/GR_rec_09092022/final_result/GRinj_GR_rec_1_100_data83_1242442967-459473_analysis_H1L1V1_merge_result.json,/home1/srashti.goyal/tgr-lensing/codes/S190521g_bilby_pipe/background/nGR_rec_09092022/final_result/GRinj_nGR_rec_1_100_data83_1242442967-459473_analysis_H1L1V1_merge_result.json,83,49.82696508616573,79.34048526202832,-2488.137090809809,-2379.712668492155,108.42442231765381,29.513520175862595
84,/home1/srashti.goyal/tgr-lensing/codes/S190521g_bilby_pipe/background/GR_rec_09092022/final_result/GRinj_GR_rec_1_100_data84_1242442967-459473_analysis_H1L1V1_merge_result.json,/home1/srashti.goyal/tgr-lensing/codes/S190521g_bilby_pipe/background/nGR_rec_09092022/final_result/GRinj_nGR_rec_1_100_data84_1242442967-459473_analysis_H1L1V1_merge_result.json,84,69.68057799235385,62.114279102300316,-2448.0760725759487,-2441.960223617769,6.115848958179868,-7.566298890053531
85,/home1/srashti.goyal/tgr-lensing/codes/S190521g_bilby_pipe/background/GR_rec_09092022/final_result/GRinj_GR_rec_1_100_data85_1242442967-459473_analysis_H1L1V1_merge_result.json,/home1/srashti.goyal/tgr-lensing/codes/S190521g_bilby_pipe/background/nGR_rec_09092022/final_result/GRinj_nGR_rec_1_100_data85_1242442967-459473_analysis_H1L1V1_merge_result.json,85,86.95887867745387,55.158117481186764,-2481.3918411316595,-2466.325774296826,15.066066834833691,-31.800761196267104
86,/home1/srashti.goyal/tgr-lensing/codes/S190521g_bilby_pipe/background/GR_rec_09092022/final_result/GRinj_GR_rec_1_100_data86_1242442967-459473_analysis_H1L1V1_merge_result.json,/home1/srashti.goyal/tgr-lensing/codes/S190521g_bilby_pipe/background/nGR_rec_09092022/final_result/GRinj_nGR_rec_1_100_data86_1242442967-459473_analysis_H1L1V1_merge_result.json,86,56.08269686365111,47.32408889905628,-2401.6494988856593,-2459.6991720989045,-58.049673213245114,-8.75860796459483
87,/home1/srashti.goyal/tgr-lensing/codes/S190521g_bilby_pipe/background/GR_rec_09092022/final_result/GRinj_GR_rec_1_100_data87_1242442967-459473_analysis_H1L1V1_merge_result.json,/home1/srashti.goyal/tgr-lensing/codes/S190521g_bilby_pipe/background/nGR_rec_09092022/final_result/GRinj_nGR_rec_1_100_data87_1242442967-459473_analysis_H1L1V1_merge_result.json,87,53.93068904398888,59.287260425266595,-2447.3386709006786,-2451.7551271146262,-4.41645621394764,5.356571381277718
88,/home1/srashti.goyal/tgr-lensing/codes/S190521g_bilby_pipe/background/GR_rec_09092022/final_result/GRinj_GR_rec_1_100_data88_1242442967-459473_analysis_H1L1V1_merge_result.json,/home1/srashti.goyal/tgr-lensing/codes/S190521g_bilby_pipe/background/nGR_rec_09092022/final_result/GRinj_nGR_rec_1_100_data88_1242442967-459473_analysis_H1L1V1_merge_result.json,88,78.90020280177032,62.75425654022183,-2412.5394652618133,-2421.0018180534057,-8.462352791592366,-16.145946261548488
89,/home1/srashti.goyal/tgr-lensing/codes/S190521g_bilby_pipe/background/GR_rec_09092022/final_result/GRinj_GR_rec_1_100_data89_1242442967-459473_analysis_H1L1V1_merge_result.json,/home1/srashti.goyal/tgr-lensing/codes/S190521g_bilby_pipe/background/nGR_rec_09092022/final_result/GRinj_nGR_rec_1_100_data89_1242442967-459473_analysis_H1L1V1_merge_result.json,89,57.41598046934905,55.17365372739505,-2562.9002245321662,-2510.111134895099,52.78908963706726,-2.2423267419540025
90,/home1/srashti.goyal/tgr-lensing/codes/S190521g_bilby_pipe/background/GR_rec_09092022/final_result/GRinj_GR_rec_1_100_data90_1242442967-459473_analysis_H1L1V1_merge_result.json,/home1/srashti.goyal/tgr-lensing/codes/S190521g_bilby_pipe/background/nGR_rec_09092022/final_result/GRinj_nGR_rec_1_100_data90_1242442967-459473_analysis_H1L1V1_merge_result.json,90,74.19335333797471,72.35244175159187,-2410.1745335187634,-2419.679353348195,-9.504819829431653,-1.8409115863828447
91,/home1/srashti.goyal/tgr-lensing/codes/S190521g_bilby_pipe/background/GR_rec_09092022/final_result/GRinj_GR_rec_1_100_data91_1242442967-459473_analysis_H1L1V1_merge_result.json,/home1/srashti.goyal/tgr-lensing/codes/S190521g_bilby_pipe/background/nGR_rec_09092022/final_result/GRinj_nGR_rec_1_100_data91_1242442967-459473_analysis_H1L1V1_merge_result.json,91,48.48062117683821,52.26804445955622,-2513.4916870652696,-2436.5655449106216,76.926142154648,3.7874232827180094
92,/home1/srashti.goyal/tgr-lensing/codes/S190521g_bilby_pipe/background/GR_rec_09092022/final_result/GRinj_GR_rec_1_100_data92_1242442967-459473_analysis_H1L1V1_merge_result.json,/home1/srashti.goyal/tgr-lensing/codes/S190521g_bilby_pipe/background/nGR_rec_09092022/final_result/GRinj_nGR_rec_1_100_data92_1242442967-459473_analysis_H1L1V1_merge_result.json,92,62.89149998970652,78.42559662166104,-2496.4018343793664,-2451.315952636851,45.08588174251554,15.534096631954526
93,/home1/srashti.goyal/tgr-lensing/codes/S190521g_bilby_pipe/background/GR_rec_09092022/final_result/GRinj_GR_rec_1_100_data93_1242442967-459473_analysis_H1L1V1_merge_result.json,/home1/srashti.goyal/tgr-lensing/codes/S190521g_bilby_pipe/background/nGR_rec_09092022/final_result/GRinj_nGR_rec_1_100_data93_1242442967-459473_analysis_H1L1V1_merge_result.json,93,64.88252367499581,72.94820589417805,-2436.939011728017,-2441.181804048088,-4.242792320071203,8.065682219182236
94,/home1/srashti.goyal/tgr-lensing/codes/S190521g_bilby_pipe/background/GR_rec_09092022/final_result/GRinj_GR_rec_1_100_data94_1242442967-459473_analysis_H1L1V1_merge_result.json,/home1/srashti.goyal/tgr-lensing/codes/S190521g_bilby_pipe/background/nGR_rec_09092022/final_result/GRinj_nGR_rec_1_100_data94_1242442967-459473_analysis_H1L1V1_merge_result.json,94,35.95954895714294,57.782834882288626,-2432.6809576677556,-2588.4230946051753,-155.74213693741967,21.823285925145683
95,/home1/srashti.goyal/tgr-lensing/codes/S190521g_bilby_pipe/background/GR_rec_09092022/final_result/GRinj_GR_rec_1_100_data95_1242442967-459473_analysis_H1L1V1_merge_result.json,/home1/srashti.goyal/tgr-lensing/codes/S190521g_bilby_pipe/background/nGR_rec_09092022/final_result/GRinj_nGR_rec_1_100_data95_1242442967-459473_analysis_H1L1V1_merge_result.json,95,78.02802599291317,69.36886415685922,-2377.803555032133,-2375.7193612648352,2.08419376729762,-8.659161836053954
96,/home1/srashti.goyal/tgr-lensing/codes/S190521g_bilby_pipe/background/GR_rec_09092022/final_result/GRinj_GR_rec_1_100_data96_1242442967-459473_analysis_H1L1V1_merge_result.json,/home1/srashti.goyal/tgr-lensing/codes/S190521g_bilby_pipe/background/nGR_rec_09092022/final_result/GRinj_nGR_rec_1_100_data96_1242442967-459473_analysis_H1L1V1_merge_result.json,96,78.46504265501426,81.31401075446365,-2469.525671675273,-2575.475621813202,-105.94995013792914,2.8489680994493938
97,/home1/srashti.goyal/tgr-lensing/codes/S190521g_bilby_pipe/background/GR_rec_09092022/final_result/GRinj_GR_rec_1_100_data97_1242442967-459473_analysis_H1L1V1_merge_result.json,/home1/srashti.goyal/tgr-lensing/codes/S190521g_bilby_pipe/background/nGR_rec_09092022/final_result/GRinj_nGR_rec_1_100_data97_1242442967-459473_analysis_H1L1V1_merge_result.json,97,36.789996933280236,46.962678070563015,-2482.372203304666,-2405.835424277927,76.53677902673917,10.17268113728278
98,/home1/srashti.goyal/tgr-lensing/codes/S190521g_bilby_pipe/background/GR_rec_09092022/final_result/GRinj_GR_rec_1_100_data98_1242442967-459473_analysis_H1L1V1_merge_result.json,/home1/srashti.goyal/tgr-lensing/codes/S190521g_bilby_pipe/background/nGR_rec_09092022/final_result/GRinj_nGR_rec_1_100_data98_1242442967-459473_analysis_H1L1V1_merge_result.json,98,86.2767210341608,75.31418977734484,-2427.25729424439,-2503.618858462803,-76.36156421841315,-10.962531256815964
99,/home1/srashti.goyal/tgr-lensing/codes/S190521g_bilby_pipe/background/GR_rec_09092022/final_result/GRinj_GR_rec_1_100_data99_1242442967-459473_analysis_H1L1V1_merge_result.json,/home1/srashti.goyal/tgr-lensing/codes/S190521g_bilby_pipe/background/nGR_rec_09092022/final_result/GRinj_nGR_rec_1_100_data99_1242442967-459473_analysis_H1L1V1_merge_result.json,99,54.641024625183036,67.03981809014385,-2459.4141696704505,-2463.753455871518,-4.3392862010673525,12.398793464960818
