[
  {
    "snr_range": [null, 20],
    "mchirp_range": [null, 2.6],
    "limits": [
      {
        "param": "mchirp",
        "lower": {
          "formula": "v1",
          "settings": {
            "param_power": 0.6666666666667,
            "const": 0.0023545,
            "reciprocal": true
          }
        },
        "upper": {
          "formula": "v1",
          "settings": {
            "param_power": 0.6666666666667,
            "const": -0.0015467,
            "reciprocal": true
          }
        }
      },
      {
        "param": "q",
        "lower": {
          "formula": "v1",
          "settings": {
            "const": -0.851577514511174
          }
        },
        "upper": {
          "formula": "const",
          "settings": {
            "const": 1.0
          }
        }
      }
    ]
  },
  {
    "snr_range": [null, 20],
    "mchirp_range": [2.6, 10],
    "limits": [
      {
        "param": "mchirp",
        "lower": {
          "formula": "v1",
          "settings": {
            "const": -0.020734
          }
        },
        "upper": {
          "formula": "v1",
          "settings": {
            "const": 0.035184
          }
        }
      },
      {
        "param": "q",
        "lower": {
          "formula": "v1",
          "settings": {
            "const": -0.851577514511174
          }
        },
        "upper": {
          "formula": "const",
          "settings": {
            "const": 1.0
          }
        }
      }
    ]
  },
  {
    "snr_range": [null, 20],
    "mchirp_range": [10, null],
    "limits": [
      {
        "param": "mtotal",
        "lower": {
          "formula": "v1",
          "settings": {
            "const": -0.63634
          }
        },
        "upper": {
          "formula": "v1",
          "settings": {
            "const": 0.059813
          }
        }
      },
      {
        "param": "q",
        "lower": {
          "formula": "v1",
          "settings": {
            "const": -0.851577514511174
          }
        },
        "upper": {
          "formula": "const",
          "settings": {
            "const": 1.0
          }
        }
      }
    ]
  },
  {
    "snr_range": [20, null],
    "mchirp_range": [null, 2.6],
    "limits": [
      {
        "param": "mchirp",
        "lower": {
          "formula": "v1",
          "settings": {
            "const": 0.052258,
            "param_power": 0.6666666666666666,
            "snr_power": -1.0,
            "reciprocal": true
          }
        },
        "upper": {
          "formula": "v1",
          "settings": {
            "const": -0.025852,
            "param_power": 0.6666666666666666,
            "snr_power": -1.0,
            "reciprocal": true
          }
        }
      },
      {
        "param": "q",
        "lower": {
          "formula": "v1",
          "settings": {
            "const": -0.851577514511174
          }
        },
        "upper": {
          "formula": "const",
          "settings": {
            "const": 1.0
          }
        }
      }
    ]
  },
  {
    "snr_range": [20, null],
    "mchirp_range": [2.6, 10],
    "limits": [
      {
        "param": "mchirp",
        "lower": {
          "formula": "v1",
          "settings": {
            "const": -0.72743,
            "snr_power": -1.0
          }
        },
        "upper": {
          "formula": "v1",
          "settings": {
            "const": 0.43117,
            "snr_power": -1.0
          }
        }
      },
      {
        "param": "q",
        "lower": {
          "formula": "v1",
          "settings": {
            "const": -0.851577514511174
          }
        },
        "upper": {
          "formula": "const",
          "settings": {
            "const": 1.0
          }
        }
      }
    ]
  },
  {
    "snr_range": [20, null],
    "mchirp_range": [10, null],
    "limits": [
      {
        "param": "mtotal",
        "lower": {
          "formula": "v1",
          "settings": {
            "const": -1.1457,
            "snr_power": -0.2
          }
        },
        "upper": {
          "formula": "v1",
          "settings": {
            "const": 0.04260663,
            "snr_power": -0.2
          }
        }
      },
      {
        "param": "q",
        "lower": {
          "formula": "v1",
          "settings": {
            "const": -0.851577514511174
          }
        },
        "upper": {
          "formula": "const",
          "settings": {
            "const": 1.0
          }
        }
      }
    ]
  }
]
