# mass1 mass2 spin1z spin2z latitude longitude distance psi0 phi0 inclination geocent_end_time original_index
1.555591 1.241091 8.798271e-05 -0.0002747585 0.7315845 2.591276 343.9037 0.0 0.4710048 0.5388591 969932695.257790565 0
1.408325 1.267252 -0.03131498 -0.001842097 -0.7751282 5.676617 148.0418 0.0 0.7379345 2.625914 969766596.237029791 1
