\relax 
\@writefile{toc}{\contentsline {section}{\numberline {1}Should we care about a gap of polarization angle between the detectors?}{1}\protected@file@percent }
\newlabel{polarization}{{1}{1}}
\newlabel{phase_shift}{{1}{1}}
\newlabel{phase_correction}{{2}{1}}
\newlabel{xi_correction}{{4}{1}}
\@writefile{toc}{\contentsline {section}{\numberline {2}Correlator is alomost equivalent to Likelihood}{1}\protected@file@percent }
\newlabel{CorrelatorLikelihood}{{2}{1}}
\newlabel{DefinitionLikelihood}{{5}{1}}
\newlabel{h_max}{{9}{2}}
\newlabel{L_SL}{{10}{2}}
\newlabel{logL}{{12}{2}}
\@writefile{toc}{\contentsline {section}{\numberline {3}How do we synthesize the map with ones of different baseline?}{2}\protected@file@percent }
\newlabel{baseline}{{3}{2}}
\@writefile{lof}{\contentsline {figure}{\numberline {1}{\ignorespaces Software injection at $\theta =135^\circ , \phi =45^\circ $. To synthesize, addition is used.}}{3}\protected@file@percent }
\newlabel{sum_map}{{1}{3}}
\@writefile{lof}{\contentsline {figure}{\numberline {2}{\ignorespaces Software injection at $\theta =135^\circ , \phi =45^\circ $. To synthesize, multiplication is used.}}{3}\protected@file@percent }
\newlabel{multi_map}{{2}{3}}
\@writefile{lof}{\contentsline {figure}{\numberline {3}{\ignorespaces The map of GW170814. To synthesize, addition is used.}}{4}\protected@file@percent }
\newlabel{GW170814_sum}{{3}{4}}
\@writefile{lof}{\contentsline {figure}{\numberline {4}{\ignorespaces The map of GW170814. To synthesize, multiplication is used.}}{4}\protected@file@percent }
\newlabel{GW170814_multi}{{4}{4}}
\@writefile{toc}{\contentsline {section}{\numberline {4}We should care about phase gap for the map by addition; Supplement of Sec.1\@setref@ {} and Sec.3\@setref@ {}}{5}\protected@file@percent }
\newlabel{Sec:phase_gap}{{4}{5}}
\@writefile{toc}{\contentsline {section}{\numberline {5}Can we discuss about SNR data with same way?}{5}\protected@file@percent }
\@writefile{lof}{\contentsline {figure}{\numberline {5}{\ignorespaces The map for Likelihood (NO multipication N in \textup  {\hbox {\mathsurround \z@ \normalfont  (\ignorespaces 12\@setref@ {}\unskip \@@italiccorr )}}) of GW170814. Taking into account polarization.}}{6}\protected@file@percent }
\newlabel{GW170814_polarization}{{5}{6}}
\@writefile{lof}{\contentsline {figure}{\numberline {6}{\ignorespaces The map for Likelihood ratio of GW170814. Taking into account polarization. Note that we used SNR data.}}{6}\protected@file@percent }
\newlabel{GW170814_polarization_L}{{6}{6}}
\@writefile{toc}{\contentsline {section}{\numberline {6}From Likelihood ratio to posterior}{7}\protected@file@percent }
\newlabel{exactLikelihood}{{22}{7}}
\@writefile{lof}{\contentsline {figure}{\numberline {7}{\ignorespaces The map of $P^{GW}$.}}{8}\protected@file@percent }
\newlabel{Fig:projection_operator}{{7}{8}}
\@writefile{lof}{\contentsline {figure}{\numberline {8}{\ignorespaces The map of $|$logLikelihood ratio$|$ of GW. Using only offdiagonal part.}}{8}\protected@file@percent }
\newlabel{Fig:logL_offdiagonal}{{8}{8}}
\@writefile{lof}{\contentsline {figure}{\numberline {9}{\ignorespaces The map of $|$logLikelihood ratio$|$ of GW. Using also diagonal part.}}{9}\protected@file@percent }
\newlabel{Fig:logL_diagonal}{{9}{9}}
\@writefile{toc}{\contentsline {section}{\numberline {7}Projection Operator \leavevmode {\color  {red}incorrect}}{9}\protected@file@percent }
\@writefile{toc}{\contentsline {section}{\numberline {8}Relation of Bayestar}{9}\protected@file@percent }
\@writefile{toc}{\contentsline {section}{\numberline {9}gauge degree of freedom}{9}\protected@file@percent }
\@writefile{lof}{\contentsline {figure}{\numberline {10}{\ignorespaces The map of Likelihood ratio of GW. Using also diagonal part.}}{10}\protected@file@percent }
\newlabel{Fig:L_diagonal}{{10}{10}}
\@writefile{toc}{\contentsline {section}{\numberline {10}How to synthesize the map \leavevmode {\color  {red}incorrect?}}{10}\protected@file@percent }
\@writefile{toc}{\contentsline {section}{\numberline {11}Could we maximize Likelihood? \leavevmode {\color  {red}NO PROBLEM}}{11}\protected@file@percent }
\@writefile{toc}{\contentsline {section}{\numberline {12}Did Sutton do similar thing?}{11}\protected@file@percent }
\@writefile{toc}{\contentsline {section}{\numberline {13}Phase factor from the inconsistence of mode \leavevmode {\color  {red}NO PROBLEM}}{11}\protected@file@percent }
\@writefile{toc}{\contentsline {section}{\numberline {14}Time \leavevmode {\color  {red}incorrect}}{11}\protected@file@percent }
\@writefile{lof}{\contentsline {figure}{\numberline {11}{\ignorespaces The map injected from $\delta = -88^\circ , \phi = 15^\circ $. Mismatch. \leavevmode {\color  {red}Due to bug!}}}{12}\protected@file@percent }
\newlabel{Fig:R(+90,+90)}{{11}{12}}
\@writefile{toc}{\contentsline {section}{\numberline {15}$Y_{lm}$ expansion}{13}\protected@file@percent }
\@writefile{toc}{\contentsline {section}{\numberline {16}Weakness to noise in Time Domain}{14}\protected@file@percent }
\@writefile{toc}{\contentsline {section}{\numberline {17}Preliminary}{14}\protected@file@percent }
\@writefile{lof}{\contentsline {figure}{\numberline {12}{\ignorespaces The map of GW170814 with correlation.}}{15}\protected@file@percent }
\newlabel{Fig:GWmap}{{12}{15}}
\@writefile{lof}{\contentsline {figure}{\numberline {13}{\ignorespaces The map of GW170814 with bayestar.}}{15}\protected@file@percent }
\newlabel{Fig:bayestar}{{13}{15}}
\@writefile{lof}{\contentsline {figure}{\numberline {14}{\ignorespaces The map of GW170814 with correlatiion. To avoid the noise effect, duration is set short and phase is rotate to maximize our Likelihood.}}{16}\protected@file@percent }
\newlabel{Fig:map_GW_diagonalshift_hand}{{14}{16}}
\@writefile{lof}{\contentsline {figure}{\numberline {15}{\ignorespaces The zoom map of GW170814 with correlation. To avoid the noise effect, duration is set short and phase is rotate to maximize our Likelihood.}}{16}\protected@file@percent }
\newlabel{Fig:map_GW_diagonalshift_hand_zoom}{{15}{16}}
\@writefile{toc}{\contentsline {section}{\numberline {18}Derivation}{17}\protected@file@percent }
