\relax 
\@writefile{toc}{\contentsline {section}{\numberline {1}Introduction}{1}\protected@file@percent }
\@writefile{toc}{\contentsline {section}{\numberline {2}Preliminary}{1}\protected@file@percent }
\newlabel{EQ:S_rho}{{9}{1}}
\citation{Sutton}
\citation{Sutton}
\@writefile{toc}{\contentsline {section}{\numberline {3}Derivation}{2}\protected@file@percent }
\@writefile{toc}{\contentsline {subsection}{\numberline {3.1}Likelihood}{2}\protected@file@percent }
\newlabel{EQ:SLmiddle}{{16}{2}}
\newlabel{EQ:P}{{17}{2}}
\newlabel{EQ:simple_projection}{{18}{2}}
\newlabel{EQ:Likelihood}{{22}{2}}
\citation{Kipp}
\@writefile{toc}{\contentsline {subsection}{\numberline {3.2}$Y_{lm}$ expansion}{3}\protected@file@percent }
\newlabel{EQ:TY}{{25}{3}}
\newlabel{EQ:PY}{{27}{3}}
\newlabel{EQ:precalc}{{30}{3}}
\@writefile{toc}{\contentsline {section}{\numberline {4}Result}{3}\protected@file@percent }
\@writefile{toc}{\contentsline {section}{\numberline {5}Future Work}{3}\protected@file@percent }
\@writefile{toc}{\contentsline {section}{\numberline {6}Conclusion}{3}\protected@file@percent }
\@writefile{toc}{\contentsline {section}{\numberline {7}Acknowledgment}{3}\protected@file@percent }
\@writefile{toc}{\contentsline {section}{\numberline {8}Appendix}{3}\protected@file@percent }
\@writefile{toc}{\contentsline {subsection}{\numberline {8.1}Derivation of SNR variance}{3}\protected@file@percent }
\@writefile{toc}{\contentsline {subsection}{\numberline {8.2}Dominant Polarization angle}{3}\protected@file@percent }
\@writefile{toc}{\contentsline {subsection}{\numberline {8.3}Threshold of $\mathaccentV {tilde}07E{\rho }$}{4}\protected@file@percent }
\@writefile{toc}{\contentsline {subsection}{\numberline {8.4}Detail of precalculated factor $X$}{4}\protected@file@percent }
\bibcite{Sutton}{1}
\bibcite{Kipp}{2}
