{
    "created": "2018-09-19 18:29:20 UTC", 
    "extra_attributes": {
        "LalInferenceBurst": {
            "bci": 1.111, 
            "bsn": 7.19, 
            "frequency_mean": 721.23, 
            "frequency_median": 718.03, 
            "hrss_mean": 8.12e-23, 
            "hrss_median": 2.19e-23, 
            "omicron_snr_H1": 4.98, 
            "omicron_snr_L1": 4.99, 
            "omicron_snr_V1": null, 
            "omicron_snr_network": 6.91, 
            "quality_mean": 15.2, 
            "quality_median": 15.1
        }
    }, 
    "far": 7.22e-06, 
    "far_is_upper_limit": false, 
    "gpstime": 1216336200.66, 
    "graceid": "T0144", 
    "group": "Test", 
    "instruments": "H1,L1", 
    "labels": [], 
    "likelihood": null, 
    "links": {
        "emobservations": "https://gracedb.ligo.org/api/events/T0144/emobservation/", 
        "files": "https://gracedb.ligo.org/api/events/T0144/files/", 
        "labels": "https://gracedb.ligo.org/api/events/T0144/labels/", 
        "log": "https://gracedb.ligo.org/api/events/T0144/log/", 
        "neighbors": "https://gracedb.ligo.org/api/events/T0144/neighbors/", 
        "self": "https://gracedb.ligo.org/api/events/T0144", 
        "tags": "https://gracedb.ligo.org/api/events/T0144/tag/"
    }, 
    "nevents": 1, 
    "offline": false, 
    "pipeline": "oLIB", 
    "submitter": "albert.einstein@LIGO.ORG", 
    "superevent": null
}
