040-EXneardoor_Acou30to2k,1185901209,1185905791
041-EXneardoor_Acou30to2k_x2,1185901209,1185905951
047-EXmechdoor_Acou30to2k,1185901209,1185912483
048-EXmechdoor_Acou30to2k_x2,1185901209,1185912619
049-EXmechdoor_Acou100to700,1185901209,1185912832
052-EXebay_Acou30to2k,1185901209,1185914646
053-EXebay_Acou100to2k,1185901209,1185914817