#FIG 3.2  Produced by xfig version 3.2.9
#encoding: UTF-8
Landscape
Center
Metric
A4
100.00
Single
-2
1200 2
6 3555 1755 4095 2295
2 1 0 3 7 7 40 -1 -1 0.000 0 0 -1 0 0 2
	 3600 1800 4050 2250
2 1 0 3 7 7 40 -1 -1 0.000 0 0 -1 0 0 2
	 4072 1822 3622 2272
-6
6 4455 2205 4995 2745
2 1 0 3 7 7 40 -1 -1 0.000 0 0 -1 0 0 2
	 4500 2250 4950 2700
2 1 0 3 7 7 40 -1 -1 0.000 0 0 -1 0 0 2
	 4972 2272 4522 2722
-6
6 4005 2655 4545 3195
2 1 0 3 7 7 40 -1 -1 0.000 0 0 -1 0 0 2
	 4050 2700 4500 3150
2 1 0 3 7 7 40 -1 -1 0.000 0 0 -1 0 0 2
	 4522 2722 4072 3172
-6
6 5355 3105 5895 3645
2 1 0 3 7 7 40 -1 -1 0.000 0 0 -1 0 0 2
	 5400 3150 5850 3600
2 1 0 3 7 7 40 -1 -1 0.000 0 0 -1 0 0 2
	 5872 3172 5422 3622
-6
2 2 0 1 0 7 50 -1 -1 0.000 0 0 -1 0 0 5
	 3150 2250 3600 2250 3600 2700 3150 2700 3150 2250
2 2 0 1 0 7 50 -1 -1 0.000 0 0 -1 0 0 5
	 3600 2700 4050 2700 4050 3150 3600 3150 3600 2700
2 2 0 1 0 7 50 -1 -1 0.000 0 0 -1 0 0 5
	 3150 2700 3600 2700 3600 3150 3150 3150 3150 2700
2 2 0 1 0 7 50 -1 -1 0.000 0 0 -1 0 0 5
	 3150 3150 3600 3150 3600 3600 3150 3600 3150 3150
2 2 0 1 0 7 50 -1 -1 0.000 0 0 -1 0 0 5
	 3600 3150 4050 3150 4050 3600 3600 3600 3600 3150
2 2 0 1 0 7 50 -1 -1 0.000 0 0 -1 0 0 5
	 3600 3600 4050 3600 4050 4050 3600 4050 3600 3600
2 2 0 1 0 7 50 -1 -1 0.000 0 0 -1 0 0 5
	 3150 3600 3600 3600 3600 4050 3150 4050 3150 3600
2 2 0 1 0 7 50 -1 -1 0.000 0 0 -1 0 0 5
	 3150 4050 3600 4050 3600 4500 3150 4500 3150 4050
2 2 0 1 0 7 50 -1 -1 0.000 0 0 -1 0 0 5
	 3600 4050 4050 4050 4050 4500 3600 4500 3600 4050
2 2 0 1 0 7 50 -1 -1 0.000 0 0 -1 0 0 5
	 3150 4500 3600 4500 3600 4950 3150 4950 3150 4500
2 2 0 1 0 7 50 -1 -1 0.000 0 0 -1 0 0 5
	 3150 4950 3600 4950 3600 5400 3150 5400 3150 4950
2 2 0 1 0 7 50 -1 -1 0.000 0 0 -1 0 0 5
	 3600 4950 4050 4950 4050 5400 3600 5400 3600 4950
2 2 0 1 0 7 50 -1 -1 0.000 0 0 -1 0 0 5
	 3600 5400 4050 5400 4050 5850 3600 5850 3600 5400
2 2 0 1 0 7 50 -1 -1 0.000 0 0 -1 0 0 5
	 3150 5400 3600 5400 3600 5850 3150 5850 3150 5400
2 2 0 1 0 7 50 -1 -1 0.000 0 0 -1 0 0 5
	 3150 5850 3600 5850 3600 6300 3150 6300 3150 5850
2 2 0 1 0 7 50 -1 -1 0.000 0 0 -1 0 0 5
	 3600 5850 4050 5850 4050 6300 3600 6300 3600 5850
2 2 0 1 0 7 50 -1 -1 0.000 0 0 -1 0 0 5
	 3600 6300 4050 6300 4050 6750 3600 6750 3600 6300
2 2 0 1 0 7 50 -1 -1 0.000 0 0 -1 0 0 5
	 3150 6300 3600 6300 3600 6750 3150 6750 3150 6300
2 2 0 1 0 7 50 -1 -1 0.000 0 0 -1 0 0 5
	 3150 6750 3600 6750 3600 7200 3150 7200 3150 6750
2 2 0 1 0 7 50 -1 -1 0.000 0 0 -1 0 0 5
	 3600 6750 4050 6750 4050 7200 3600 7200 3600 6750
2 2 0 1 0 7 50 -1 -1 0.000 0 0 -1 0 0 5
	 3600 7200 4050 7200 4050 7650 3600 7650 3600 7200
2 2 0 1 0 7 50 -1 -1 0.000 0 0 -1 0 0 5
	 3150 7200 3600 7200 3600 7650 3150 7650 3150 7200
2 2 0 1 0 7 50 -1 -1 0.000 0 0 -1 0 0 5
	 3150 7650 3600 7650 3600 8100 3150 8100 3150 7650
2 2 0 1 0 7 50 -1 -1 0.000 0 0 -1 0 0 5
	 3600 7650 4050 7650 4050 8100 3600 8100 3600 7650
2 2 0 1 0 7 50 -1 -1 0.000 0 0 -1 0 0 5
	 3600 8100 4050 8100 4050 8550 3600 8550 3600 8100
2 2 0 1 0 7 50 -1 -1 0.000 0 0 -1 0 0 5
	 3150 8100 3600 8100 3600 8550 3150 8550 3150 8100
2 2 0 1 0 7 50 -1 -1 0.000 0 0 -1 0 0 5
	 4500 1800 4950 1800 4950 2250 4500 2250 4500 1800
2 2 0 1 0 8 50 -1 20 0.000 0 0 -1 0 0 5
	 4500 2250 4950 2250 4950 2700 4500 2700 4500 2250
2 2 0 1 0 7 50 -1 -1 0.000 0 0 -1 0 0 5
	 4500 2700 4950 2700 4950 3150 4500 3150 4500 2700
2 2 0 1 0 8 50 -1 20 0.000 0 0 -1 0 0 5
	 4050 2700 4500 2700 4500 3150 4050 3150 4050 2700
2 2 0 1 0 7 50 -1 -1 0.000 0 0 -1 0 0 5
	 4050 3150 4500 3150 4500 3600 4050 3600 4050 3150
2 2 0 1 0 7 50 -1 -1 0.000 0 0 -1 0 0 5
	 4500 3150 4950 3150 4950 3600 4500 3600 4500 3150
2 2 0 1 0 7 50 -1 -1 0.000 0 0 -1 0 0 5
	 4500 3600 4950 3600 4950 4050 4500 4050 4500 3600
2 2 0 1 0 7 50 -1 -1 0.000 0 0 -1 0 0 5
	 4050 3600 4500 3600 4500 4050 4050 4050 4050 3600
2 2 0 1 0 7 50 -1 -1 0.000 0 0 -1 0 0 5
	 4050 4050 4500 4050 4500 4500 4050 4500 4050 4050
2 2 0 1 0 7 50 -1 -1 0.000 0 0 -1 0 0 5
	 4500 4050 4950 4050 4950 4500 4500 4500 4500 4050
2 2 0 1 0 7 50 -1 -1 0.000 0 0 -1 0 0 5
	 4500 4500 4950 4500 4950 4950 4500 4950 4500 4500
2 2 0 1 0 7 50 -1 -1 0.000 0 0 -1 0 0 5
	 4050 4500 4500 4500 4500 4950 4050 4950 4050 4500
2 2 0 1 0 7 50 -1 -1 0.000 0 0 -1 0 0 5
	 4050 4950 4500 4950 4500 5400 4050 5400 4050 4950
2 2 0 1 0 7 50 -1 -1 0.000 0 0 -1 0 0 5
	 4500 4950 4950 4950 4950 5400 4500 5400 4500 4950
2 2 0 1 0 7 50 -1 -1 0.000 0 0 -1 0 0 5
	 4500 5400 4950 5400 4950 5850 4500 5850 4500 5400
2 2 0 1 0 7 50 -1 -1 0.000 0 0 -1 0 0 5
	 4050 5400 4500 5400 4500 5850 4050 5850 4050 5400
2 2 0 1 0 7 50 -1 -1 0.000 0 0 -1 0 0 5
	 4050 5850 4500 5850 4500 6300 4050 6300 4050 5850
2 2 0 1 0 7 50 -1 -1 0.000 0 0 -1 0 0 5
	 4500 5850 4950 5850 4950 6300 4500 6300 4500 5850
2 2 0 1 0 7 50 -1 -1 0.000 0 0 -1 0 0 5
	 4500 6300 4950 6300 4950 6750 4500 6750 4500 6300
2 2 0 1 0 7 50 -1 -1 0.000 0 0 -1 0 0 5
	 4050 6300 4500 6300 4500 6750 4050 6750 4050 6300
2 2 0 1 0 7 50 -1 -1 0.000 0 0 -1 0 0 5
	 4050 6750 4500 6750 4500 7200 4050 7200 4050 6750
2 2 0 1 0 7 50 -1 -1 0.000 0 0 -1 0 0 5
	 4500 6750 4950 6750 4950 7200 4500 7200 4500 6750
2 2 0 1 0 7 50 -1 -1 0.000 0 0 -1 0 0 5
	 4500 7200 4950 7200 4950 7650 4500 7650 4500 7200
2 2 0 1 0 7 50 -1 -1 0.000 0 0 -1 0 0 5
	 4050 7200 4500 7200 4500 7650 4050 7650 4050 7200
2 2 0 1 0 7 50 -1 -1 0.000 0 0 -1 0 0 5
	 4050 7650 4500 7650 4500 8100 4050 8100 4050 7650
2 2 0 1 0 7 50 -1 -1 0.000 0 0 -1 0 0 5
	 4500 7650 4950 7650 4950 8100 4500 8100 4500 7650
2 2 0 1 0 7 50 -1 -1 0.000 0 0 -1 0 0 5
	 4500 8100 4950 8100 4950 8550 4500 8550 4500 8100
2 2 0 1 0 7 50 -1 -1 0.000 0 0 -1 0 0 5
	 4050 8100 4500 8100 4500 8550 4050 8550 4050 8100
2 2 0 1 0 7 50 -1 -1 0.000 0 0 -1 0 0 5
	 4950 1800 5400 1800 5400 2250 4950 2250 4950 1800
2 2 0 1 0 7 50 -1 -1 0.000 0 0 -1 0 0 5
	 5400 1800 5850 1800 5850 2250 5400 2250 5400 1800
2 2 0 1 0 7 50 -1 -1 0.000 0 0 -1 0 0 5
	 4950 2250 5400 2250 5400 2700 4950 2700 4950 2250
2 2 0 1 0 7 50 -1 -1 0.000 0 0 -1 0 0 5
	 5400 2250 5850 2250 5850 2700 5400 2700 5400 2250
2 2 0 1 0 7 50 -1 -1 0.000 0 0 -1 0 0 5
	 5400 2700 5850 2700 5850 3150 5400 3150 5400 2700
2 2 0 1 0 7 50 -1 -1 0.000 0 0 -1 0 0 5
	 4950 2700 5400 2700 5400 3150 4950 3150 4950 2700
2 2 0 1 0 7 50 -1 -1 0.000 0 0 -1 0 0 5
	 4950 3150 5400 3150 5400 3600 4950 3600 4950 3150
2 2 0 1 0 8 50 -1 20 0.000 0 0 -1 0 0 5
	 5400 3150 5850 3150 5850 3600 5400 3600 5400 3150
2 2 0 1 0 7 50 -1 -1 0.000 0 0 -1 0 0 5
	 5400 3600 5850 3600 5850 4050 5400 4050 5400 3600
2 2 0 1 0 7 50 -1 -1 0.000 0 0 -1 0 0 5
	 4950 3600 5400 3600 5400 4050 4950 4050 4950 3600
2 2 0 1 0 7 50 -1 -1 0.000 0 0 -1 0 0 5
	 4950 4050 5400 4050 5400 4500 4950 4500 4950 4050
2 2 0 1 0 7 50 -1 -1 0.000 0 0 -1 0 0 5
	 5400 4050 5850 4050 5850 4500 5400 4500 5400 4050
2 2 0 1 0 7 50 -1 -1 0.000 0 0 -1 0 0 5
	 5400 4500 5850 4500 5850 4950 5400 4950 5400 4500
2 2 0 1 0 7 50 -1 -1 0.000 0 0 -1 0 0 5
	 4950 4500 5400 4500 5400 4950 4950 4950 4950 4500
2 2 0 1 0 7 50 -1 -1 0.000 0 0 -1 0 0 5
	 4950 4950 5400 4950 5400 5400 4950 5400 4950 4950
2 2 0 1 0 7 50 -1 -1 0.000 0 0 -1 0 0 5
	 5400 4950 5850 4950 5850 5400 5400 5400 5400 4950
2 2 0 1 0 7 50 -1 -1 0.000 0 0 -1 0 0 5
	 5400 5400 5850 5400 5850 5850 5400 5850 5400 5400
2 2 0 1 0 7 50 -1 -1 0.000 0 0 -1 0 0 5
	 4950 5400 5400 5400 5400 5850 4950 5850 4950 5400
2 2 0 1 0 7 50 -1 -1 0.000 0 0 -1 0 0 5
	 4950 5850 5400 5850 5400 6300 4950 6300 4950 5850
2 2 0 1 0 7 50 -1 -1 0.000 0 0 -1 0 0 5
	 5400 5850 5850 5850 5850 6300 5400 6300 5400 5850
2 2 0 1 0 7 50 -1 -1 0.000 0 0 -1 0 0 5
	 5400 6300 5850 6300 5850 6750 5400 6750 5400 6300
2 2 0 1 0 7 50 -1 -1 0.000 0 0 -1 0 0 5
	 4950 6300 5400 6300 5400 6750 4950 6750 4950 6300
2 2 0 1 0 7 50 -1 -1 0.000 0 0 -1 0 0 5
	 4950 6750 5400 6750 5400 7200 4950 7200 4950 6750
2 2 0 1 0 7 50 -1 -1 0.000 0 0 -1 0 0 5
	 5400 6750 5850 6750 5850 7200 5400 7200 5400 6750
2 2 0 1 0 7 50 -1 -1 0.000 0 0 -1 0 0 5
	 5400 7200 5850 7200 5850 7650 5400 7650 5400 7200
2 2 0 1 0 7 50 -1 -1 0.000 0 0 -1 0 0 5
	 4950 7200 5400 7200 5400 7650 4950 7650 4950 7200
2 2 0 1 0 7 50 -1 -1 0.000 0 0 -1 0 0 5
	 4950 7650 5400 7650 5400 8100 4950 8100 4950 7650
2 2 0 1 0 7 50 -1 -1 0.000 0 0 -1 0 0 5
	 5400 7650 5850 7650 5850 8100 5400 8100 5400 7650
2 2 0 1 0 7 50 -1 -1 0.000 0 0 -1 0 0 5
	 5400 8100 5850 8100 5850 8550 5400 8550 5400 8100
2 2 0 1 0 7 50 -1 -1 0.000 0 0 -1 0 0 5
	 4950 8100 5400 8100 5400 8550 4950 8550 4950 8100
2 2 0 1 0 7 50 -1 -1 0.000 0 0 -1 0 0 5
	 5850 1800 6300 1800 6300 2250 5850 2250 5850 1800
2 2 0 1 0 7 50 -1 -1 0.000 0 0 -1 0 0 5
	 5850 2250 6300 2250 6300 2700 5850 2700 5850 2250
2 2 0 1 0 7 50 -1 -1 0.000 0 0 -1 0 0 5
	 5850 2700 6300 2700 6300 3150 5850 3150 5850 2700
2 2 0 1 0 7 50 -1 -1 0.000 0 0 -1 0 0 5
	 5850 3150 6300 3150 6300 3600 5850 3600 5850 3150
2 2 0 1 0 7 50 -1 -1 0.000 0 0 -1 0 0 5
	 5850 3600 6300 3600 6300 4050 5850 4050 5850 3600
2 2 0 1 0 7 50 -1 -1 0.000 0 0 -1 0 0 5
	 5850 4050 6300 4050 6300 4500 5850 4500 5850 4050
2 2 0 1 0 7 50 -1 -1 0.000 0 0 -1 0 0 5
	 6300 4050 6750 4050 6750 4500 6300 4500 6300 4050
2 2 0 1 0 7 50 -1 -1 0.000 0 0 -1 0 0 5
	 5850 4500 6300 4500 6300 4950 5850 4950 5850 4500
2 2 0 1 0 7 50 -1 -1 0.000 0 0 -1 0 0 5
	 5850 4950 6300 4950 6300 5400 5850 5400 5850 4950
2 2 0 1 0 7 50 -1 -1 0.000 0 0 -1 0 0 5
	 5850 5400 6300 5400 6300 5850 5850 5850 5850 5400
2 2 0 1 0 7 50 -1 -1 0.000 0 0 -1 0 0 5
	 5850 5850 6300 5850 6300 6300 5850 6300 5850 5850
2 2 0 1 0 7 50 -1 -1 0.000 0 0 -1 0 0 5
	 5850 6300 6300 6300 6300 6750 5850 6750 5850 6300
2 2 0 1 0 7 50 -1 -1 0.000 0 0 -1 0 0 5
	 5850 6750 6300 6750 6300 7200 5850 7200 5850 6750
2 2 0 1 0 7 50 -1 -1 0.000 0 0 -1 0 0 5
	 5850 7200 6300 7200 6300 7650 5850 7650 5850 7200
2 2 0 1 0 7 50 -1 -1 0.000 0 0 -1 0 0 5
	 5850 7650 6300 7650 6300 8100 5850 8100 5850 7650
2 2 0 1 0 7 50 -1 -1 0.000 0 0 -1 0 0 5
	 6300 8100 6750 8100 6750 8550 6300 8550 6300 8100
2 2 0 1 0 7 50 -1 -1 0.000 0 0 -1 0 0 5
	 5850 8100 6300 8100 6300 8550 5850 8550 5850 8100
2 2 0 1 0 7 50 -1 -1 0.000 0 0 -1 0 0 5
	 7200 2250 7650 2250 7650 2700 7200 2700 7200 2250
2 2 0 1 0 7 50 -1 -1 0.000 0 0 -1 0 0 5
	 7200 2700 7650 2700 7650 3150 7200 3150 7200 2700
2 2 0 1 0 8 50 -1 20 0.000 0 0 -1 0 0 5
	 6750 4050 7200 4050 7200 4500 6750 4500 6750 4050
2 2 0 1 0 7 50 -1 -1 0.000 0 0 -1 0 0 5
	 7200 4050 7650 4050 7650 4500 7200 4500 7200 4050
2 2 0 1 0 8 50 -1 20 0.000 0 0 -1 0 0 5
	 6750 4500 7200 4500 7200 4950 6750 4950 6750 4500
2 2 0 1 0 7 50 -1 -1 0.000 0 0 -1 0 0 5
	 7200 4950 7650 4950 7650 5400 7200 5400 7200 4950
2 2 0 1 0 7 50 -1 -1 0.000 0 0 -1 0 0 5
	 7200 5850 7650 5850 7650 6300 7200 6300 7200 5850
2 2 0 1 0 8 50 -1 20 0.000 0 0 -1 0 0 5
	 6750 7650 7200 7650 7200 8100 6750 8100 6750 7650
2 2 0 1 0 7 50 -1 -1 0.000 0 0 -1 0 0 5
	 7200 7650 7650 7650 7650 8100 7200 8100 7200 7650
2 2 0 1 0 7 50 -1 -1 0.000 0 0 -1 0 0 5
	 7200 8100 7650 8100 7650 8550 7200 8550 7200 8100
2 2 0 1 0 7 50 -1 -1 0.000 0 0 -1 0 0 5
	 7650 1800 8100 1800 8100 2250 7650 2250 7650 1800
2 2 0 1 0 7 50 -1 -1 0.000 0 0 -1 0 0 5
	 8100 1800 8550 1800 8550 2250 8100 2250 8100 1800
2 2 0 1 0 7 50 -1 -1 0.000 0 0 -1 0 0 5
	 7650 2250 8100 2250 8100 2700 7650 2700 7650 2250
2 2 0 1 0 7 50 -1 -1 0.000 0 0 -1 0 0 5
	 8100 2250 8550 2250 8550 2700 8100 2700 8100 2250
2 2 0 1 0 7 50 -1 -1 0.000 0 0 -1 0 0 5
	 8100 2700 8550 2700 8550 3150 8100 3150 8100 2700
2 2 0 1 0 7 50 -1 -1 0.000 0 0 -1 0 0 5
	 7650 2700 8100 2700 8100 3150 7650 3150 7650 2700
2 2 0 1 0 7 50 -1 -1 0.000 0 0 -1 0 0 5
	 7650 3150 8100 3150 8100 3600 7650 3600 7650 3150
2 2 0 1 0 7 50 -1 -1 0.000 0 0 -1 0 0 5
	 8100 3150 8550 3150 8550 3600 8100 3600 8100 3150
2 2 0 1 0 7 50 -1 -1 0.000 0 0 -1 0 0 5
	 8100 3600 8550 3600 8550 4050 8100 4050 8100 3600
2 2 0 1 0 7 50 -1 -1 0.000 0 0 -1 0 0 5
	 7650 3600 8100 3600 8100 4050 7650 4050 7650 3600
2 2 0 1 0 7 50 -1 -1 0.000 0 0 -1 0 0 5
	 7650 4050 8100 4050 8100 4500 7650 4500 7650 4050
2 2 0 1 0 7 50 -1 -1 0.000 0 0 -1 0 0 5
	 8100 4050 8550 4050 8550 4500 8100 4500 8100 4050
2 2 0 1 0 7 50 -1 -1 0.000 0 0 -1 0 0 5
	 8100 4500 8550 4500 8550 4950 8100 4950 8100 4500
2 2 0 1 0 7 50 -1 -1 0.000 0 0 -1 0 0 5
	 7650 4500 8100 4500 8100 4950 7650 4950 7650 4500
2 2 0 1 0 7 50 -1 -1 0.000 0 0 -1 0 0 5
	 7650 4950 8100 4950 8100 5400 7650 5400 7650 4950
2 2 0 1 0 7 50 -1 -1 0.000 0 0 -1 0 0 5
	 8100 4950 8550 4950 8550 5400 8100 5400 8100 4950
2 2 0 1 0 7 50 -1 -1 0.000 0 0 -1 0 0 5
	 8100 5400 8550 5400 8550 5850 8100 5850 8100 5400
2 2 0 1 0 7 50 -1 -1 0.000 0 0 -1 0 0 5
	 7650 5400 8100 5400 8100 5850 7650 5850 7650 5400
2 2 0 1 0 7 50 -1 -1 0.000 0 0 -1 0 0 5
	 7650 5850 8100 5850 8100 6300 7650 6300 7650 5850
2 2 0 1 0 7 50 -1 -1 0.000 0 0 -1 0 0 5
	 8100 5850 8550 5850 8550 6300 8100 6300 8100 5850
2 2 0 1 0 7 50 -1 -1 0.000 0 0 -1 0 0 5
	 8100 6300 8550 6300 8550 6750 8100 6750 8100 6300
2 2 0 1 0 7 50 -1 -1 0.000 0 0 -1 0 0 5
	 7650 6300 8100 6300 8100 6750 7650 6750 7650 6300
2 2 0 1 0 7 50 -1 -1 0.000 0 0 -1 0 0 5
	 7650 6750 8100 6750 8100 7200 7650 7200 7650 6750
2 2 0 1 0 7 50 -1 -1 0.000 0 0 -1 0 0 5
	 8100 6750 8550 6750 8550 7200 8100 7200 8100 6750
2 2 0 1 0 7 50 -1 -1 0.000 0 0 -1 0 0 5
	 8100 7200 8550 7200 8550 7650 8100 7650 8100 7200
2 2 0 1 0 8 50 -1 20 0.000 0 0 -1 0 0 5
	 7650 7200 8100 7200 8100 7650 7650 7650 7650 7200
2 2 0 1 0 7 50 -1 -1 0.000 0 0 -1 0 0 5
	 7650 7650 8100 7650 8100 8100 7650 8100 7650 7650
2 2 0 1 0 7 50 -1 -1 0.000 0 0 -1 0 0 5
	 8100 7650 8550 7650 8550 8100 8100 8100 8100 7650
2 2 0 1 0 7 50 -1 -1 0.000 0 0 -1 0 0 5
	 8100 8100 8550 8100 8550 8550 8100 8550 8100 8100
2 2 0 1 0 7 50 -1 -1 0.000 0 0 -1 0 0 5
	 7650 8100 8100 8100 8100 8550 7650 8550 7650 8100
2 2 0 1 0 7 50 -1 -1 0.000 0 0 -1 0 0 5
	 8550 1800 9000 1800 9000 2250 8550 2250 8550 1800
2 2 0 1 0 7 50 -1 -1 0.000 0 0 -1 0 0 5
	 9000 1800 9450 1800 9450 2250 9000 2250 9000 1800
2 2 0 1 0 7 50 -1 -1 0.000 0 0 -1 0 0 5
	 8550 2250 9000 2250 9000 2700 8550 2700 8550 2250
2 2 0 1 0 7 50 -1 -1 0.000 0 0 -1 0 0 5
	 9000 2250 9450 2250 9450 2700 9000 2700 9000 2250
2 2 0 1 0 7 50 -1 -1 0.000 0 0 -1 0 0 5
	 9000 2700 9450 2700 9450 3150 9000 3150 9000 2700
2 2 0 1 0 7 50 -1 -1 0.000 0 0 -1 0 0 5
	 8550 2700 9000 2700 9000 3150 8550 3150 8550 2700
2 2 0 1 0 7 50 -1 -1 0.000 0 0 -1 0 0 5
	 8550 3150 9000 3150 9000 3600 8550 3600 8550 3150
2 2 0 1 0 7 50 -1 -1 0.000 0 0 -1 0 0 5
	 9000 3150 9450 3150 9450 3600 9000 3600 9000 3150
2 2 0 1 0 7 50 -1 -1 0.000 0 0 -1 0 0 5
	 9000 3600 9450 3600 9450 4050 9000 4050 9000 3600
2 2 0 1 0 7 50 -1 -1 0.000 0 0 -1 0 0 5
	 8550 3600 9000 3600 9000 4050 8550 4050 8550 3600
2 2 0 1 0 7 50 -1 -1 0.000 0 0 -1 0 0 5
	 8550 4050 9000 4050 9000 4500 8550 4500 8550 4050
2 2 0 1 0 7 50 -1 -1 0.000 0 0 -1 0 0 5
	 9000 4050 9450 4050 9450 4500 9000 4500 9000 4050
2 2 0 1 0 7 50 -1 -1 0.000 0 0 -1 0 0 5
	 9000 4500 9450 4500 9450 4950 9000 4950 9000 4500
2 2 0 1 0 7 50 -1 -1 0.000 0 0 -1 0 0 5
	 8550 4500 9000 4500 9000 4950 8550 4950 8550 4500
2 2 0 1 0 7 50 -1 -1 0.000 0 0 -1 0 0 5
	 8550 4950 9000 4950 9000 5400 8550 5400 8550 4950
2 2 0 1 0 7 50 -1 -1 0.000 0 0 -1 0 0 5
	 9000 4950 9450 4950 9450 5400 9000 5400 9000 4950
2 2 0 1 0 7 50 -1 -1 0.000 0 0 -1 0 0 5
	 9000 5400 9450 5400 9450 5850 9000 5850 9000 5400
2 2 0 1 0 7 50 -1 -1 0.000 0 0 -1 0 0 5
	 8550 5400 9000 5400 9000 5850 8550 5850 8550 5400
2 2 0 1 0 7 50 -1 -1 0.000 0 0 -1 0 0 5
	 8550 5850 9000 5850 9000 6300 8550 6300 8550 5850
2 2 0 1 0 7 50 -1 -1 0.000 0 0 -1 0 0 5
	 9000 5850 9450 5850 9450 6300 9000 6300 9000 5850
2 2 0 1 0 7 50 -1 -1 0.000 0 0 -1 0 0 5
	 9000 6300 9450 6300 9450 6750 9000 6750 9000 6300
2 2 0 1 0 7 50 -1 -1 0.000 0 0 -1 0 0 5
	 8550 6300 9000 6300 9000 6750 8550 6750 8550 6300
2 2 0 1 0 7 50 -1 -1 0.000 0 0 -1 0 0 5
	 8550 6750 9000 6750 9000 7200 8550 7200 8550 6750
2 2 0 1 0 7 50 -1 -1 0.000 0 0 -1 0 0 5
	 9000 6750 9450 6750 9450 7200 9000 7200 9000 6750
2 2 0 1 0 7 50 -1 -1 0.000 0 0 -1 0 0 5
	 9000 7200 9450 7200 9450 7650 9000 7650 9000 7200
2 2 0 1 0 7 50 -1 -1 0.000 0 0 -1 0 0 5
	 8550 7200 9000 7200 9000 7650 8550 7650 8550 7200
2 2 0 1 0 7 50 -1 -1 0.000 0 0 -1 0 0 5
	 8550 7650 9000 7650 9000 8100 8550 8100 8550 7650
2 2 0 1 0 7 50 -1 -1 0.000 0 0 -1 0 0 5
	 9000 7650 9450 7650 9450 8100 9000 8100 9000 7650
2 2 0 1 0 7 50 -1 -1 0.000 0 0 -1 0 0 5
	 9000 8100 9450 8100 9450 8550 9000 8550 9000 8100
2 2 0 1 0 7 50 -1 -1 0.000 0 0 -1 0 0 5
	 8550 8100 9000 8100 9000 8550 8550 8550 8550 8100
2 2 0 1 0 7 50 -1 -1 0.000 0 0 -1 0 0 5
	 9450 1800 9900 1800 9900 2250 9450 2250 9450 1800
2 2 0 1 0 7 50 -1 -1 0.000 0 0 -1 0 0 5
	 9900 1800 10350 1800 10350 2250 9900 2250 9900 1800
2 2 0 1 0 7 50 -1 -1 0.000 0 0 -1 0 0 5
	 9450 2250 9900 2250 9900 2700 9450 2700 9450 2250
2 2 0 1 0 7 50 -1 -1 0.000 0 0 -1 0 0 5
	 9900 2250 10350 2250 10350 2700 9900 2700 9900 2250
2 2 0 1 0 7 50 -1 -1 0.000 0 0 -1 0 0 5
	 9900 2700 10350 2700 10350 3150 9900 3150 9900 2700
2 2 0 1 0 7 50 -1 -1 0.000 0 0 -1 0 0 5
	 9450 2700 9900 2700 9900 3150 9450 3150 9450 2700
2 2 0 1 0 7 50 -1 -1 0.000 0 0 -1 0 0 5
	 9450 3150 9900 3150 9900 3600 9450 3600 9450 3150
2 2 0 1 0 7 50 -1 -1 0.000 0 0 -1 0 0 5
	 9900 3150 10350 3150 10350 3600 9900 3600 9900 3150
2 2 0 1 0 7 50 -1 -1 0.000 0 0 -1 0 0 5
	 9900 3600 10350 3600 10350 4050 9900 4050 9900 3600
2 2 0 1 0 7 50 -1 -1 0.000 0 0 -1 0 0 5
	 9450 3600 9900 3600 9900 4050 9450 4050 9450 3600
2 2 0 1 0 7 50 -1 -1 0.000 0 0 -1 0 0 5
	 9450 4050 9900 4050 9900 4500 9450 4500 9450 4050
2 2 0 1 0 7 50 -1 -1 0.000 0 0 -1 0 0 5
	 9900 4050 10350 4050 10350 4500 9900 4500 9900 4050
2 2 0 1 0 7 50 -1 -1 0.000 0 0 -1 0 0 5
	 9900 4500 10350 4500 10350 4950 9900 4950 9900 4500
2 2 0 1 0 7 50 -1 -1 0.000 0 0 -1 0 0 5
	 9450 4500 9900 4500 9900 4950 9450 4950 9450 4500
2 2 0 1 0 7 50 -1 -1 0.000 0 0 -1 0 0 5
	 9450 4950 9900 4950 9900 5400 9450 5400 9450 4950
2 2 0 1 0 7 50 -1 -1 0.000 0 0 -1 0 0 5
	 9900 4950 10350 4950 10350 5400 9900 5400 9900 4950
2 2 0 1 0 7 50 -1 -1 0.000 0 0 -1 0 0 5
	 9900 5400 10350 5400 10350 5850 9900 5850 9900 5400
2 2 0 1 0 7 50 -1 -1 0.000 0 0 -1 0 0 5
	 9450 5400 9900 5400 9900 5850 9450 5850 9450 5400
2 2 0 1 0 7 50 -1 -1 0.000 0 0 -1 0 0 5
	 9450 5850 9900 5850 9900 6300 9450 6300 9450 5850
2 2 0 1 0 7 50 -1 -1 0.000 0 0 -1 0 0 5
	 9900 5850 10350 5850 10350 6300 9900 6300 9900 5850
2 2 0 1 0 7 50 -1 -1 0.000 0 0 -1 0 0 5
	 9900 6300 10350 6300 10350 6750 9900 6750 9900 6300
2 2 0 1 0 7 50 -1 -1 0.000 0 0 -1 0 0 5
	 9450 6300 9900 6300 9900 6750 9450 6750 9450 6300
2 2 0 1 0 7 50 -1 -1 0.000 0 0 -1 0 0 5
	 9450 6750 9900 6750 9900 7200 9450 7200 9450 6750
2 2 0 1 0 7 50 -1 -1 0.000 0 0 -1 0 0 5
	 9900 6750 10350 6750 10350 7200 9900 7200 9900 6750
2 2 0 1 0 7 50 -1 -1 0.000 0 0 -1 0 0 5
	 9900 7200 10350 7200 10350 7650 9900 7650 9900 7200
2 2 0 1 0 7 50 -1 -1 0.000 0 0 -1 0 0 5
	 9450 7200 9900 7200 9900 7650 9450 7650 9450 7200
2 2 0 1 0 7 50 -1 -1 0.000 0 0 -1 0 0 5
	 9450 7650 9900 7650 9900 8100 9450 8100 9450 7650
2 2 0 1 0 7 50 -1 -1 0.000 0 0 -1 0 0 5
	 9900 7650 10350 7650 10350 8100 9900 8100 9900 7650
2 2 0 1 0 7 50 -1 -1 0.000 0 0 -1 0 0 5
	 9900 8100 10350 8100 10350 8550 9900 8550 9900 8100
2 2 0 1 0 7 50 -1 -1 0.000 0 0 -1 0 0 5
	 9450 8100 9900 8100 9900 8550 9450 8550 9450 8100
2 2 0 1 0 7 50 -1 -1 0.000 0 0 -1 0 0 5
	 10350 1800 10800 1800 10800 2250 10350 2250 10350 1800
2 2 0 1 0 7 50 -1 -1 0.000 0 0 -1 0 0 5
	 10800 1800 11250 1800 11250 2250 10800 2250 10800 1800
2 2 0 1 0 7 50 -1 -1 0.000 0 0 -1 0 0 5
	 10350 2250 10800 2250 10800 2700 10350 2700 10350 2250
2 2 0 1 0 7 50 -1 -1 0.000 0 0 -1 0 0 5
	 10800 2250 11250 2250 11250 2700 10800 2700 10800 2250
2 2 0 1 0 7 50 -1 -1 0.000 0 0 -1 0 0 5
	 10800 2700 11250 2700 11250 3150 10800 3150 10800 2700
2 2 0 1 0 7 50 -1 -1 0.000 0 0 -1 0 0 5
	 10350 2700 10800 2700 10800 3150 10350 3150 10350 2700
2 2 0 1 0 7 50 -1 -1 0.000 0 0 -1 0 0 5
	 10350 3150 10800 3150 10800 3600 10350 3600 10350 3150
2 2 0 1 0 7 50 -1 -1 0.000 0 0 -1 0 0 5
	 10800 3150 11250 3150 11250 3600 10800 3600 10800 3150
2 2 0 1 0 7 50 -1 -1 0.000 0 0 -1 0 0 5
	 10800 3600 11250 3600 11250 4050 10800 4050 10800 3600
2 2 0 1 0 7 50 -1 -1 0.000 0 0 -1 0 0 5
	 10350 3600 10800 3600 10800 4050 10350 4050 10350 3600
2 2 0 1 0 7 50 -1 -1 0.000 0 0 -1 0 0 5
	 10350 4050 10800 4050 10800 4500 10350 4500 10350 4050
2 2 0 1 0 7 50 -1 -1 0.000 0 0 -1 0 0 5
	 10800 4050 11250 4050 11250 4500 10800 4500 10800 4050
2 2 0 1 0 7 50 -1 -1 0.000 0 0 -1 0 0 5
	 10800 4500 11250 4500 11250 4950 10800 4950 10800 4500
2 2 0 1 0 7 50 -1 -1 0.000 0 0 -1 0 0 5
	 10350 4500 10800 4500 10800 4950 10350 4950 10350 4500
2 2 0 1 0 7 50 -1 -1 0.000 0 0 -1 0 0 5
	 10350 4950 10800 4950 10800 5400 10350 5400 10350 4950
2 2 0 1 0 7 50 -1 -1 0.000 0 0 -1 0 0 5
	 10800 4950 11250 4950 11250 5400 10800 5400 10800 4950
2 2 0 1 0 7 50 -1 -1 0.000 0 0 -1 0 0 5
	 10800 5400 11250 5400 11250 5850 10800 5850 10800 5400
2 2 0 1 0 7 50 -1 -1 0.000 0 0 -1 0 0 5
	 10350 5400 10800 5400 10800 5850 10350 5850 10350 5400
2 2 0 1 0 7 50 -1 -1 0.000 0 0 -1 0 0 5
	 10350 5850 10800 5850 10800 6300 10350 6300 10350 5850
2 2 0 1 0 7 50 -1 -1 0.000 0 0 -1 0 0 5
	 10800 5850 11250 5850 11250 6300 10800 6300 10800 5850
2 2 0 1 0 7 50 -1 -1 0.000 0 0 -1 0 0 5
	 10800 6300 11250 6300 11250 6750 10800 6750 10800 6300
2 2 0 1 0 7 50 -1 -1 0.000 0 0 -1 0 0 5
	 10350 6300 10800 6300 10800 6750 10350 6750 10350 6300
2 2 0 1 0 7 50 -1 -1 0.000 0 0 -1 0 0 5
	 10350 6750 10800 6750 10800 7200 10350 7200 10350 6750
2 2 0 1 0 7 50 -1 -1 0.000 0 0 -1 0 0 5
	 10800 6750 11250 6750 11250 7200 10800 7200 10800 6750
2 2 0 1 0 7 50 -1 -1 0.000 0 0 -1 0 0 5
	 10800 7200 11250 7200 11250 7650 10800 7650 10800 7200
2 2 0 1 0 7 50 -1 -1 0.000 0 0 -1 0 0 5
	 10350 7200 10800 7200 10800 7650 10350 7650 10350 7200
2 2 0 1 0 7 50 -1 -1 0.000 0 0 -1 0 0 5
	 10350 7650 10800 7650 10800 8100 10350 8100 10350 7650
2 2 0 1 0 7 50 -1 -1 0.000 0 0 -1 0 0 5
	 10800 7650 11250 7650 11250 8100 10800 8100 10800 7650
2 2 0 1 0 7 50 -1 -1 0.000 0 0 -1 0 0 5
	 10800 8100 11250 8100 11250 8550 10800 8550 10800 8100
2 2 0 1 0 7 50 -1 -1 0.000 0 0 -1 0 0 5
	 10350 8100 10800 8100 10800 8550 10350 8550 10350 8100
2 2 0 1 0 7 50 -1 -1 0.000 0 0 -1 0 0 5
	 11250 1800 11700 1800 11700 2250 11250 2250 11250 1800
2 2 0 1 0 7 50 -1 -1 0.000 0 0 -1 0 0 5
	 11700 1800 12150 1800 12150 2250 11700 2250 11700 1800
2 2 0 1 0 7 50 -1 -1 0.000 0 0 -1 0 0 5
	 11250 2250 11700 2250 11700 2700 11250 2700 11250 2250
2 2 0 1 0 7 50 -1 -1 0.000 0 0 -1 0 0 5
	 11700 2250 12150 2250 12150 2700 11700 2700 11700 2250
2 2 0 1 0 7 50 -1 -1 0.000 0 0 -1 0 0 5
	 11700 2700 12150 2700 12150 3150 11700 3150 11700 2700
2 2 0 1 0 7 50 -1 -1 0.000 0 0 -1 0 0 5
	 11250 2700 11700 2700 11700 3150 11250 3150 11250 2700
2 2 0 1 0 7 50 -1 -1 0.000 0 0 -1 0 0 5
	 11250 3150 11700 3150 11700 3600 11250 3600 11250 3150
2 2 0 1 0 7 50 -1 -1 0.000 0 0 -1 0 0 5
	 11700 3150 12150 3150 12150 3600 11700 3600 11700 3150
2 2 0 1 0 7 50 -1 -1 0.000 0 0 -1 0 0 5
	 11700 3600 12150 3600 12150 4050 11700 4050 11700 3600
2 2 0 1 0 7 50 -1 -1 0.000 0 0 -1 0 0 5
	 11250 3600 11700 3600 11700 4050 11250 4050 11250 3600
2 2 0 1 0 7 50 -1 -1 0.000 0 0 -1 0 0 5
	 11250 4050 11700 4050 11700 4500 11250 4500 11250 4050
2 2 0 1 0 7 50 -1 -1 0.000 0 0 -1 0 0 5
	 11700 4050 12150 4050 12150 4500 11700 4500 11700 4050
2 2 0 1 0 7 50 -1 -1 0.000 0 0 -1 0 0 5
	 11700 4500 12150 4500 12150 4950 11700 4950 11700 4500
2 2 0 1 0 7 50 -1 -1 0.000 0 0 -1 0 0 5
	 11250 4500 11700 4500 11700 4950 11250 4950 11250 4500
2 2 0 1 0 7 50 -1 -1 0.000 0 0 -1 0 0 5
	 11250 4950 11700 4950 11700 5400 11250 5400 11250 4950
2 2 0 1 0 7 50 -1 -1 0.000 0 0 -1 0 0 5
	 11700 4950 12150 4950 12150 5400 11700 5400 11700 4950
2 2 0 1 0 7 50 -1 -1 0.000 0 0 -1 0 0 5
	 11700 5400 12150 5400 12150 5850 11700 5850 11700 5400
2 2 0 1 0 7 50 -1 -1 0.000 0 0 -1 0 0 5
	 11250 5400 11700 5400 11700 5850 11250 5850 11250 5400
2 2 0 1 0 7 50 -1 -1 0.000 0 0 -1 0 0 5
	 11250 5850 11700 5850 11700 6300 11250 6300 11250 5850
2 2 0 1 0 7 50 -1 -1 0.000 0 0 -1 0 0 5
	 11700 5850 12150 5850 12150 6300 11700 6300 11700 5850
2 2 0 1 0 7 50 -1 -1 0.000 0 0 -1 0 0 5
	 11700 6300 12150 6300 12150 6750 11700 6750 11700 6300
2 2 0 1 0 7 50 -1 -1 0.000 0 0 -1 0 0 5
	 11250 6300 11700 6300 11700 6750 11250 6750 11250 6300
2 2 0 1 0 7 50 -1 -1 0.000 0 0 -1 0 0 5
	 11250 6750 11700 6750 11700 7200 11250 7200 11250 6750
2 2 0 1 0 7 50 -1 -1 0.000 0 0 -1 0 0 5
	 11700 6750 12150 6750 12150 7200 11700 7200 11700 6750
2 2 0 1 0 7 50 -1 -1 0.000 0 0 -1 0 0 5
	 11700 7200 12150 7200 12150 7650 11700 7650 11700 7200
2 2 0 1 0 7 50 -1 -1 0.000 0 0 -1 0 0 5
	 11250 7200 11700 7200 11700 7650 11250 7650 11250 7200
2 2 0 1 0 7 50 -1 -1 0.000 0 0 -1 0 0 5
	 11250 7650 11700 7650 11700 8100 11250 8100 11250 7650
2 2 0 1 0 7 50 -1 -1 0.000 0 0 -1 0 0 5
	 11700 7650 12150 7650 12150 8100 11700 8100 11700 7650
2 2 0 1 0 7 50 -1 -1 0.000 0 0 -1 0 0 5
	 11700 8100 12150 8100 12150 8550 11700 8550 11700 8100
2 2 0 1 0 7 50 -1 -1 0.000 0 0 -1 0 0 5
	 11250 8100 11700 8100 11700 8550 11250 8550 11250 8100
2 2 0 1 0 7 50 -1 -1 0.000 0 0 -1 0 0 5
	 12150 1800 12600 1800 12600 2250 12150 2250 12150 1800
2 2 0 1 0 7 50 -1 -1 0.000 0 0 -1 0 0 5
	 12600 1800 13050 1800 13050 2250 12600 2250 12600 1800
2 2 0 1 0 7 50 -1 -1 0.000 0 0 -1 0 0 5
	 12150 2250 12600 2250 12600 2700 12150 2700 12150 2250
2 2 0 1 0 7 50 -1 -1 0.000 0 0 -1 0 0 5
	 12600 2250 13050 2250 13050 2700 12600 2700 12600 2250
2 2 0 1 0 7 50 -1 -1 0.000 0 0 -1 0 0 5
	 12600 2700 13050 2700 13050 3150 12600 3150 12600 2700
2 2 0 1 0 7 50 -1 -1 0.000 0 0 -1 0 0 5
	 12150 2700 12600 2700 12600 3150 12150 3150 12150 2700
2 2 0 1 0 7 50 -1 -1 0.000 0 0 -1 0 0 5
	 12150 3150 12600 3150 12600 3600 12150 3600 12150 3150
2 2 0 1 0 7 50 -1 -1 0.000 0 0 -1 0 0 5
	 12600 3150 13050 3150 13050 3600 12600 3600 12600 3150
2 2 0 1 0 7 50 -1 -1 0.000 0 0 -1 0 0 5
	 12600 3600 13050 3600 13050 4050 12600 4050 12600 3600
2 2 0 1 0 7 50 -1 -1 0.000 0 0 -1 0 0 5
	 12150 3600 12600 3600 12600 4050 12150 4050 12150 3600
2 2 0 1 0 7 50 -1 -1 0.000 0 0 -1 0 0 5
	 12150 4050 12600 4050 12600 4500 12150 4500 12150 4050
2 2 0 1 0 7 50 -1 -1 0.000 0 0 -1 0 0 5
	 12600 4050 13050 4050 13050 4500 12600 4500 12600 4050
2 2 0 1 0 7 50 -1 -1 0.000 0 0 -1 0 0 5
	 12600 4500 13050 4500 13050 4950 12600 4950 12600 4500
2 2 0 1 0 7 50 -1 -1 0.000 0 0 -1 0 0 5
	 12150 4500 12600 4500 12600 4950 12150 4950 12150 4500
2 2 0 1 0 7 50 -1 -1 0.000 0 0 -1 0 0 5
	 12150 4950 12600 4950 12600 5400 12150 5400 12150 4950
2 2 0 1 0 7 50 -1 -1 0.000 0 0 -1 0 0 5
	 12600 4950 13050 4950 13050 5400 12600 5400 12600 4950
2 2 0 1 0 7 50 -1 -1 0.000 0 0 -1 0 0 5
	 12600 5400 13050 5400 13050 5850 12600 5850 12600 5400
2 2 0 1 0 7 50 -1 -1 0.000 0 0 -1 0 0 5
	 12150 5400 12600 5400 12600 5850 12150 5850 12150 5400
2 2 0 1 0 7 50 -1 -1 0.000 0 0 -1 0 0 5
	 12150 5850 12600 5850 12600 6300 12150 6300 12150 5850
2 2 0 1 0 7 50 -1 -1 0.000 0 0 -1 0 0 5
	 12600 5850 13050 5850 13050 6300 12600 6300 12600 5850
2 2 0 1 0 7 50 -1 -1 0.000 0 0 -1 0 0 5
	 12600 6300 13050 6300 13050 6750 12600 6750 12600 6300
2 2 0 1 0 7 50 -1 -1 0.000 0 0 -1 0 0 5
	 12150 6300 12600 6300 12600 6750 12150 6750 12150 6300
2 2 0 1 0 7 50 -1 -1 0.000 0 0 -1 0 0 5
	 12150 6750 12600 6750 12600 7200 12150 7200 12150 6750
2 2 0 1 0 7 50 -1 -1 0.000 0 0 -1 0 0 5
	 12600 6750 13050 6750 13050 7200 12600 7200 12600 6750
2 2 0 1 0 7 50 -1 -1 0.000 0 0 -1 0 0 5
	 12600 7200 13050 7200 13050 7650 12600 7650 12600 7200
2 2 0 1 0 7 50 -1 -1 0.000 0 0 -1 0 0 5
	 12150 7200 12600 7200 12600 7650 12150 7650 12150 7200
2 2 0 1 0 7 50 -1 -1 0.000 0 0 -1 0 0 5
	 12150 7650 12600 7650 12600 8100 12150 8100 12150 7650
2 2 0 1 0 7 50 -1 -1 0.000 0 0 -1 0 0 5
	 12600 7650 13050 7650 13050 8100 12600 8100 12600 7650
2 2 0 1 0 7 50 -1 -1 0.000 0 0 -1 0 0 5
	 12600 8100 13050 8100 13050 8550 12600 8550 12600 8100
2 2 0 1 0 7 50 -1 -1 0.000 0 0 -1 0 0 5
	 12150 8100 12600 8100 12600 8550 12150 8550 12150 8100
2 1 1 3 27 7 45 -1 -1 8.000 0 0 -1 0 0 2
	 8100 900 8100 11295
2 1 1 3 28 7 45 -1 -1 8.000 0 0 -1 0 0 2
	 10350 900 10350 9450
2 1 1 3 29 7 45 -1 -1 8.000 0 0 -1 0 0 2
	 13050 900 13050 9450
2 1 1 3 28 7 45 -1 -1 8.000 0 0 -1 0 0 2
	 5850 900 5850 9450
2 1 1 3 29 7 45 -1 -1 8.000 0 0 -1 0 0 2
	 3150 945 3150 9495
2 1 0 2 0 7 50 -1 -1 0.000 0 0 -1 1 1 2
	2 1 6.00 60.00 120.00
	13 1 2.00 240.00 120.00
	 8100 10305 10080 10305
2 1 0 2 0 7 50 -1 -1 0.000 0 0 -1 1 1 2
	2 1 6.00 60.00 120.00
	13 1 2.00 240.00 120.00
	 8100 9540 3465 9540
2 1 0 2 0 7 50 -1 -1 0.000 0 0 -1 1 1 2
	2 1 6.00 60.00 120.00
	13 1 2.00 240.00 120.00
	 8100 10305 6120 10305
2 2 0 1 0 8 50 -1 20 0.000 0 0 -1 0 0 5
	 6750 8100 7200 8100 7200 8550 6750 8550 6750 8100
2 2 0 1 0 7 50 -1 -1 0.000 0 0 -1 0 0 5
	 7200 7200 7650 7200 7650 7650 7200 7650 7200 7200
2 2 0 1 0 7 50 -1 -1 0.000 0 0 -1 0 0 5
	 6300 7650 6750 7650 6750 8100 6300 8100 6300 7650
2 2 0 1 0 7 50 -1 -1 0.000 0 0 -1 0 0 5
	 6300 4950 6750 4950 6750 5400 6300 5400 6300 4950
2 2 0 1 0 8 50 -1 20 0.000 0 0 -1 0 0 5
	 6750 4950 7200 4950 7200 5400 6750 5400 6750 4950
2 2 0 1 0 7 50 -1 -1 0.000 0 0 -1 0 0 5
	 6300 4500 6750 4500 6750 4950 6300 4950 6300 4500
2 2 0 1 0 7 50 -1 -1 0.000 0 0 -1 0 0 5
	 7200 4500 7650 4500 7650 4950 7200 4950 7200 4500
2 2 0 1 0 7 50 -1 -1 0.000 0 0 -1 0 0 5
	 3600 2250 4050 2250 4050 2700 3600 2700 3600 2250
2 2 0 1 0 7 50 -1 -1 0.000 0 0 -1 0 0 5
	 4050 1800 4500 1800 4500 2250 4050 2250 4050 1800
2 2 0 1 0 7 50 -1 -1 0.000 0 0 -1 0 0 5
	 4050 2250 4500 2250 4500 2700 4050 2700 4050 2250
2 2 0 1 0 7 50 -1 -1 0.000 0 0 -1 0 0 5
	 3150 1800 3600 1800 3600 2250 3150 2250 3150 1800
2 2 0 1 0 8 50 -1 20 0.000 0 0 -1 0 0 5
	 3600 1800 4050 1800 4050 2250 3600 2250 3600 1800
2 2 0 1 0 18 50 -1 -1 0.000 0 0 -1 0 0 5
	 6750 1800 7200 1800 7200 2250 6750 2250 6750 1800
2 2 0 1 0 7 50 -1 -1 0.000 0 0 -1 0 0 5
	 6300 1800 6750 1800 6750 2250 6300 2250 6300 1800
2 2 0 1 0 18 50 -1 -1 0.000 0 0 -1 0 0 5
	 6750 2700 7200 2700 7200 3150 6750 3150 6750 2700
2 2 0 1 0 7 50 -1 -1 0.000 0 0 -1 0 0 5
	 7200 1800 7650 1800 7650 2250 7200 2250 7200 1800
2 2 0 1 0 7 50 -1 -1 0.000 0 0 -1 0 0 5
	 6300 2250 6750 2250 6750 2700 6300 2700 6300 2250
2 2 0 1 0 7 50 -1 -1 0.000 0 0 -1 0 0 5
	 6300 3150 6750 3150 6750 3600 6300 3600 6300 3150
2 2 0 1 0 7 50 -1 -1 0.000 0 0 -1 0 0 5
	 6300 5400 6750 5400 6750 5850 6300 5850 6300 5400
2 2 0 1 0 7 50 -1 -1 0.000 0 0 -1 0 0 5
	 6300 7200 6750 7200 6750 7650 6300 7650 6300 7200
2 2 0 1 0 18 50 -1 -1 0.000 0 0 -1 0 0 5
	 6750 7200 7200 7200 7200 7650 6750 7650 6750 7200
2 1 0 2 0 7 50 -1 -1 0.000 0 0 -1 1 1 2
	2 1 6.00 60.00 120.00
	13 1 2.00 240.00 120.00
	 8100 9540 12735 9540
2 1 0 2 0 7 50 -1 -1 0.000 0 0 -1 1 0 2
	1 1 8.00 60.00 120.00
	 2700 8550 2700 1800
2 1 0 2 0 7 50 -1 -1 0.000 0 0 -1 1 0 2
	1 1 8.00 60.00 120.00
	 3150 12150 13050 12150
2 2 0 1 0 18 50 -1 -1 0.000 0 0 -1 0 0 5
	 6750 3600 7200 3600 7200 4050 6750 4050 6750 3600
2 2 0 1 0 7 50 -1 -1 0.000 0 0 -1 0 0 5
	 6300 2700 6750 2700 6750 3150 6300 3150 6300 2700
2 2 0 1 0 18 50 -1 -1 0.000 0 0 -1 0 0 5
	 6750 3150 7200 3150 7200 3600 6750 3600 6750 3150
2 2 0 1 0 18 50 -1 -1 0.000 0 0 -1 0 0 5
	 6750 2250 7200 2250 7200 2700 6750 2700 6750 2250
2 1 0 3 18 7 40 -1 -1 0.000 0 0 -1 0 0 2
	 7020 630 7020 10620
2 2 0 1 0 7 50 -1 -1 0.000 0 0 -1 0 0 5
	 7200 3600 7650 3600 7650 4050 7200 4050 7200 3600
2 2 0 1 0 8 50 -1 20 0.000 0 0 -1 0 0 5
	 6300 3600 6750 3600 6750 4050 6300 4050 6300 3600
2 2 0 1 0 7 50 -1 -1 0.000 0 0 -1 0 0 5
	 7200 3150 7650 3150 7650 3600 7200 3600 7200 3150
2 2 0 1 0 8 50 -1 20 0.000 0 0 -1 0 0 5
	 7200 5400 7650 5400 7650 5850 7200 5850 7200 5400
2 2 0 1 0 18 50 -1 -1 0.000 0 0 -1 0 0 5
	 6750 5400 7200 5400 7200 5850 6750 5850 6750 5400
2 2 0 1 0 8 50 -1 20 0.000 0 0 -1 0 0 5
	 6750 6300 7200 6300 7200 6750 6750 6750 6750 6300
2 2 0 1 0 7 50 -1 -1 0.000 0 0 -1 0 0 5
	 6300 6300 6750 6300 6750 6750 6300 6750 6300 6300
2 2 0 1 0 8 50 -1 20 0.000 0 0 -1 0 0 5
	 6300 6750 6750 6750 6750 7200 6300 7200 6300 6750
2 2 0 1 0 18 50 -1 -1 0.000 0 0 -1 0 0 5
	 6750 6750 7200 6750 7200 7200 6750 7200 6750 6750
2 2 0 1 0 7 50 -1 -1 0.000 0 0 -1 0 0 5
	 7200 6750 7650 6750 7650 7200 7200 7200 7200 6750
2 2 0 1 0 18 50 -1 -1 0.000 0 0 -1 0 0 5
	 6750 5850 7200 5850 7200 6300 6750 6300 6750 5850
2 2 0 1 0 8 55 -1 20 0.000 0 0 -1 0 0 5
	 6300 5850 6750 5850 6750 6300 6300 6300 6300 5850
2 2 0 1 0 7 50 -1 -1 0.000 0 0 -1 0 0 5
	 7200 6300 7650 6300 7650 6750 7200 6750 7200 6300
2 2 0 1 0 7 50 -1 -1 0.000 0 0 -1 0 0 5
	 3600 4500 4050 4500 4050 4950 3600 4950 3600 4500
2 2 0 1 0 0 70 -1 4 0.000 0 0 -1 0 0 5
	 3150 1800 5850 1800 5850 8550 3150 8550 3150 1800
2 2 0 1 0 0 70 -1 4 0.000 0 0 -1 0 0 5
	 10350 1800 13050 1800 13050 8550 10350 8550 10350 1800
2 2 0 1 0 8 50 -1 20 0.000 0 0 -1 0 0 5
	 6300 5850 6750 5850 6750 6300 6300 6300 6300 5850
4 0 0 50 -1 0 24 0.0000 4 327 517 7065 11025 t[e]\001
4 0 0 50 -1 32 24 0.0000 4 302 179 8865 9900 d\001
4 0 0 50 -1 0 18 0.0000 4 208 361 9090 9990 det\001
4 0 0 50 -1 32 24 0.0000 4 302 179 9855 9900 d\001
4 0 0 50 -1 0 18 0.0000 4 208 338 10035 9990 cal\001
4 0 0 50 -1 0 24 0.0000 4 203 204 10440 9900 +\001
4 0 0 50 -1 0 24 0.0000 4 203 204 9540 9900 +\001
4 0 0 50 -1 32 24 0.0000 4 302 179 10710 9900 d\001
4 0 0 50 -1 0 18 0.0000 4 178 503 10890 9990 veto\001
4 0 0 50 -1 32 24 0.0000 4 302 179 8235 10710 d\001
4 0 0 50 -1 0 18 0.0000 4 208 361 8460 10755 det\001
4 0 0 50 -1 0 24 0.0000 4 203 204 8955 10710 +\001
4 0 0 50 -1 32 24 0.0000 4 302 179 9270 10710 d\001
4 0 0 50 -1 0 18 0.0000 4 208 338 9495 10755 cal\001
4 0 27 50 -1 0 24 0.0000 4 278 1795 7155 11700 slice center\001
4 0 0 50 -1 0 24 0.0000 4 361 1796 7155 12555 Time delay\001
4 0 0 50 -1 0 24 1.5708 4 354 1675 2430 5940 Frequency\001
4 0 0 50 -1 32 24 0.0000 4 302 179 6840 11025 d\001
4 0 0 50 -1 0 24 0.0000 4 238 1532 10935 1665 veto zone\001
4 0 0 50 -1 0 24 0.0000 4 238 1532 3735 1665 veto zone\001
