{
    "inj":{
        "rgb":{"r":249,"g":193,"b":0},
        "luminance":0.2
    },
    "pr":{
        "rgb":{"r":249,"g":193,"b":0},
        "luminance":0.5
    },
    "bs":{
        "rgb":{"r":249,"g":193,"b":0},
        "luminance":0.5
    },
    "na":{
        "rgb":{"r":249,"g":193,"b":0},
        "luminance":0.5
    },
    "wa":{
        "rgb":{"r":249,"g":193,"b":0},
        "luminance":0.5
    },
    "sr":{
        "rgb":{"r":249,"g":193,"b":0},
        "luminance":0.5
    },
    "det":{
        "rgb":{"r":249,"g":193,"b":0},
        "luminance":0.5
    },
    "wfm":[2124,2336,2504,2552,2449,2244,2044,1960,2039,2233,2423,2493,2393,2171,1936,1794,1783,1867,1970,2038,2068,2104,2187,2314,2430,2464,2384,2225,2073,2011,2063,2179,2269,2266,2172,2065,2039,2142,2338,2521,2578,2460,2208,1934,1752,1717,1797,1908,1965,1940,1869,1829,1879,2025,2212,2358,2397,2320,2171,2017,1917,1890,1916,1961,1999,2032,2078,2154,2251,2333,2354,2282,2130,1955,1834,1832,1962,2174,2377,2474,2414,2216,1955,1739,1649,1715,1902,2134,2328,2434,2441,2377,2279,2181,2099,2043,2020,2047,2133,2270,2419,2521,2524,2410,2217,2024,1911,1921,2031,2168,2246,2217,2101,1967,1895,1930,2053,2197,2289,2287,2197,2063,1932,1837,1788,1786,1835,1938,2079,2212,2269,2200,2010,1783,1648,1710,1984,2366,2680,2769,2585,2221,1861,1678,1739,1973,2219,2328,2241,2020,2124,2336,2504,2552,2449,2244,2044,1960,2039,2233,2423,2493,2393,2171,1936,1794,1783,1867,1970,2038,2068,2104,2187,2314,2430,2464,2384,2225,2073,2011,2063,2179,2269,2266,2172,2065,2039,2142,2338,2521,2578,2460,2208,1934,1752,1717,1797,1908,1965,1940,1869,1829,1879,2025,2212,2358,2397,2320,2171,2017,1917,1890,1916,1961,1999,2032,2078,2154,2251,2333,2354,2282,2130,1955,1834,1832,1962,2174,2377,2474,2414,2216,1955,1739,1649,1715,1902,2134,2328,2434,2441,2377,2279,2181,2099,2043,2020,2047,2133,2270,2419,2521,2524,2410,2217,2024,1911,1921,2031,2168,2246,2217,2101,1967,1895,1930,2053,2197,2289,2287,2197,2063,1932,1837,1788,1786,1835,1938,2079,2212,2269,2200,2010,1783,1648,1710,1984,2366,2680,2769,2585,2221,1861,1678,1739,1973,2219,2328,2241,2020,2124,2336,2504,2552,2449,2244,2044,1960,2039,2233,2423,2493,2393,2171,1936,1794,1783,1867,1970,2038,2068,2104,2187,2314,2430,2464,2384,2225,2073,2011,2063,2179,2269,2266,2172,2065,2039,2142,2338,2521,2578,2460,2208,1934,1752,1717,1797,1908,1965,1940,1869,1829,1879,2025,2212,2358,2397,2320,2171,2017,1917,1890,1916,1961,1999,2032,2078,2154,2251,2333,2354,2282,2130,1955,1834,1832,1962,2174,2377,2474,2414,2216,1955,1739,1649,1715,1902,2134,2328,2434,2441,2377,2279,2181,2099,2043,2020,2047,2133,2270,2419,2521,2524,2410,2217,2024,1911,1921,2031,2168,2246,2217,2101,1967,1895,1930,2053,2197,2289,2287,2197,2063,1932,1837,1788,1786,1835,1938,2079,2212,2269,2200,2010,1783,1648,1710,1984,2366,2680,2769,2585,2221,1861,1678,1739,1973,2219,2328,2241,2020,2124,2336,2504,2552,2449,2244,2044,1960,2039,2233,2423,2493,2393,2171,1936,1794,1783,1867,1970,2038,2068,2104,2187,2314,2430,2464,2384,2225,2073,2011,2063,2179,2269,2266,2172,2065,2039,2142,2338,2521,2578,2460,2208,1934,1752,1717,1797,1908,1965,1940,1869,1829,1879,2025,2212,2358,2397,2320,2171,2017,1917,1890,1916,1961,1999,2032,2078,2154,2251,2333,2354,2282,2130,1955,1834,1832,1962,2174,2377,2474,2414,2216,1955,1739,1649,1715,1902,2134,2328,2434,2441,2377,2279,2181,2099,2043,2020,2047,2133,2270,2419,2521,2524,2410,2217,2024,1911,1921,2031,2168,2246,2217,2101,1967,1895,1930,2053,2197,2289,2287,2197,2063,1932,1837,1788,1786,1835,1938,2079,2212,2269,2200,2010,1783,1648,1710,1984,2366,2680,2769,2585,2221,1861,1678,1739,1973,2219,2328,2241,2020,2124,2336,2504,2552,2449,2244,2044,1960,2039,2233,2423,2493,2393,2171,1936],
    "wfm-inv":[1971,1759,1591,1543,1646,1851,2051,2135,2056,1862,1672,1602,1702,1924,2159,2301,2312,2228,2125,2057,2027,1991,1908,1781,1665,1631,1711,1870,2022,2084,2032,1916,1826,1829,1923,2030,2056,1953,1757,1574,1517,1635,1887,2161,2343,2378,2298,2187,2130,2155,2226,2266,2216,2070,1883,1737,1698,1775,1924,2078,2178,2205,2179,2134,2096,2063,2017,1941,1844,1762,1741,1813,1965,2140,2261,2263,2133,1921,1718,1621,1681,1879,2140,2356,2446,2380,2193,1961,1767,1661,1654,1718,1816,1914,1996,2052,2075,2048,1962,1825,1676,1574,1571,1685,1878,2071,2184,2174,2064,1927,1849,1878,1994,2128,2200,2165,2042,1898,1806,1808,1898,2032,2163,2258,2307,2309,2260,2157,2016,1883,1826,1895,2085,2312,2447,2385,2111,1729,1415,1326,1510,1874,2234,2417,2356,2122,1876,1767,1854,2075,1971,1759,1591,1543,1646,1851,2051,2135,2056,1862,1672,1602,1702,1924,2159,2301,2312,2228,2125,2057,2027,1991,1908,1781,1665,1631,1711,1870,2022,2084,2032,1916,1826,1829,1923,2030,2056,1953,1757,1574,1517,1635,1887,2161,2343,2378,2298,2187,2130,2155,2226,2266,2216,2070,1883,1737,1698,1775,1924,2078,2178,2205,2179,2134,2096,2063,2017,1941,1844,1762,1741,1813,1965,2140,2261,2263,2133,1921,1718,1621,1681,1879,2140,2356,2446,2380,2193,1961,1767,1661,1654,1718,1816,1914,1996,2052,2075,2048,1962,1825,1676,1574,1571,1685,1878,2071,2184,2174,2064,1927,1849,1878,1994,2128,2200,2165,2042,1898,1806,1808,1898,2032,2163,2258,2307,2309,2260,2157,2016,1883,1826,1895,2085,2312,2447,2385,2111,1729,1415,1326,1510,1874,2234,2417,2356,2122,1876,1767,1854,2075,1971,1759,1591,1543,1646,1851,2051,2135,2056,1862,1672,1602,1702,1924,2159,2301,2312,2228,2125,2057,2027,1991,1908,1781,1665,1631,1711,1870,2022,2084,2032,1916,1826,1829,1923,2030,2056,1953,1757,1574,1517,1635,1887,2161,2343,2378,2298,2187,2130,2155,2226,2266,2216,2070,1883,1737,1698,1775,1924,2078,2178,2205,2179,2134,2096,2063,2017,1941,1844,1762,1741,1813,1965,2140,2261,2263,2133,1921,1718,1621,1681,1879,2140,2356,2446,2380,2193,1961,1767,1661,1654,1718,1816,1914,1996,2052,2075,2048,1962,1825,1676,1574,1571,1685,1878,2071,2184,2174,2064,1927,1849,1878,1994,2128,2200,2165,2042,1898,1806,1808,1898,2032,2163,2258,2307,2309,2260,2157,2016,1883,1826,1895,2085,2312,2447,2385,2111,1729,1415,1326,1510,1874,2234,2417,2356,2122,1876,1767,1854,2075,1971,1759,1591,1543,1646,1851,2051,2135,2056,1862,1672,1602,1702,1924,2159,2301,2312,2228,2125,2057,2027,1991,1908,1781,1665,1631,1711,1870,2022,2084,2032,1916,1826,1829,1923,2030,2056,1953,1757,1574,1517,1635,1887,2161,2343,2378,2298,2187,2130,2155,2226,2266,2216,2070,1883,1737,1698,1775,1924,2078,2178,2205,2179,2134,2096,2063,2017,1941,1844,1762,1741,1813,1965,2140,2261,2263,2133,1921,1718,1621,1681,1879,2140,2356,2446,2380,2193,1961,1767,1661,1654,1718,1816,1914,1996,2052,2075,2048,1962,1825,1676,1574,1571,1685,1878,2071,2184,2174,2064,1927,1849,1878,1994,2128,2200,2165,2042,1898,1806,1808,1898,2032,2163,2258,2307,2309,2260,2157,2016,1883,1826,1895,2085,2312,2447,2385,2111,1729,1415,1326,1510,1874,2234,2417,2356,2122,1876,1767,1854,2075,1971,1759,1591,1543,1646,1851,2051,2135,2056,1862,1672,1602,1702,1924,2159],
    "delay_us": 35300
}
