2.000000000000000000e+01 1.670510715502392429e+01
2.009240842693625595e+01 1.669821998463248747e+01
2.018524381974095050e+01 1.669119625334145240e+01
2.027850815117631100e+01 1.668403350426952159e+01
2.037220340311951716e+01 1.667672924359901998e+01
2.046633156660490016e+01 1.666928094029280061e+01
2.056089464186618798e+01 1.666168602582701297e+01
2.065589463837903139e+01 1.665394189393239088e+01
2.075133357490372177e+01 1.664604590033544795e+01
2.084721347952803683e+01 1.663799536252195566e+01
2.094353638971040965e+01 1.662978755952012833e+01
2.104030435232317231e+01 1.662141973166709263e+01
2.113751942369608372e+01 1.661288908042111245e+01
2.123518366966000670e+01 1.660419276817085432e+01
2.133329916559079109e+01 1.659532791806233121e+01
2.143186799645342688e+01 1.658629161384286377e+01
2.153089225684631103e+01 1.657708089970886789e+01
2.163037405104576649e+01 1.656769278020103897e+01
2.173031549305077093e+01 1.655812422008041551e+01
2.183071870662783454e+01 1.654837214424723868e+01
2.193158582535620127e+01 1.653843343766674678e+01
2.203291899267313170e+01 1.652830494531783501e+01
2.213472036191947012e+01 1.651798347217594554e+01
2.223699209638542484e+01 1.650746578318728197e+01
2.233973636935646567e+01 1.649674860329542980e+01
2.244295536415960868e+01 1.648582861746992378e+01
2.254665127420973292e+01 1.647470247077971806e+01
2.265082630305623468e+01 1.646336676845997360e+01
2.275548266442983092e+01 1.645181807604169677e+01
2.286062258228958655e+01 1.644005291947348013e+01
2.296624829087022590e+01 1.642806778529857681e+01
2.307236203472956149e+01 1.641585912083939647e+01
2.317896606879621402e+01 1.640342333442109535e+01
2.328606265841753853e+01 1.639075679561902277e+01
2.339365407940770680e+01 1.637785583554974522e+01
2.350174261809615572e+01 1.636471674717158820e+01
2.361033057137610314e+01 1.635133578563326395e+01
2.371942024675339056e+01 1.633770916864972023e+01
2.382901396239552128e+01 1.632383307692576579e+01
2.393911404718087255e+01 1.630970365458010818e+01
2.404972284074824884e+01 1.629531700964151852e+01
2.416084269354657010e+01 1.628066921455832983e+01
2.427247596688481224e+01 1.626575630675580442e+01
2.438462503298221762e+01 1.625057428921967784e+01
2.449729227501862994e+01 1.623511913113452465e+01
2.461048008718523405e+01 1.621938676854115613e+01
2.472419087473537402e+01 1.620337310504593020e+01
2.483842705403568374e+01 1.618707401256843070e+01
2.495319105261739878e+01 1.617048533212809147e+01
2.506848530922800578e+01 1.615360287466895173e+01
2.518431227388302318e+01 1.613642242192582543e+01
2.530067440791806632e+01 1.611893972733619051e+01
2.541757418404117885e+01 1.610115051699965960e+01
2.553501408638531700e+01 1.608305049066074588e+01
2.565299661056121394e+01 1.606463532275071060e+01
2.577152426371036498e+01 1.604590066347207511e+01
2.589059956455831113e+01 1.602684213991153683e+01
2.601022504346818920e+01 1.600745535721849322e+01
2.613040324249442747e+01 1.598773589980162058e+01
2.625113671543687133e+01 1.596767933258821159e+01
2.637242802789497276e+01 1.594728120232243462e+01
2.649427975732233875e+01 1.592653703889337358e+01
2.661669449308151059e+01 1.590544235672238926e+01
2.673967483649893495e+01 1.588399265618734901e+01
2.686322340092032235e+01 1.586218342507704904e+01
2.698734281176613337e+01 1.584001014010726038e+01
2.711203570658736695e+01 1.581746826846318577e+01
2.723730473512164352e+01 1.579455326938074577e+01
2.736315255934944091e+01 1.577126059577937767e+01
2.748958185355074946e+01 1.574758569591809021e+01
2.761659530436185150e+01 1.572352401510370257e+01
2.774419561083240993e+01 1.569907099741916845e+01
2.787238548448285869e+01 1.567422208750421930e+01
2.800116764936195324e+01 1.564897273235381014e+01
2.813054484210474726e+01 1.562331838316125321e+01
2.826051981199067598e+01 1.559725449718737167e+01
2.839109532100203381e+01 1.557077653965915509e+01
2.852227414388258353e+01 1.554387998569152529e+01
2.865405906819662363e+01 1.551656032225264070e+01
2.878645289438814814e+01 1.548881305012663034e+01
2.891945843584039721e+01 1.546063368592862375e+01
2.905307851893562798e+01 1.543201776411009263e+01
2.918731598311514119e+01 1.540296083900637392e+01
2.932217368093969156e+01 1.537345848688961958e+01
2.945765447815005444e+01 1.534350630803644044e+01
2.959376125372792998e+01 1.531309992880669313e+01
2.973049689995714573e+01 1.528223500372752852e+01
2.986786432248505463e+01 1.525090721759678658e+01
3.000586644038437001e+01 1.521911228757201684e+01
3.014450618621513200e+01 1.518684596527765862e+01
3.028378650608704348e+01 1.515410403889069180e+01
3.042371035972210080e+01 1.512088233524051795e+01
3.056428072051740585e+01 1.508717672189224146e+01
3.070550057560845758e+01 1.505298310921491911e+01
3.084737292593256797e+01 1.501829745245031233e+01
3.098990078629263678e+01 1.498311575374194682e+01
3.113308718542124609e+01 1.494743406417053500e+01
3.127693516604494306e+01 1.491124848574575168e+01
3.142144778494901303e+01 1.487455517338155531e+01
3.156662811304235206e+01 1.483735033683878513e+01
3.171247923542274805e+01 1.479963024263689775e+01
3.185900425144246384e+01 1.476139121592931325e+01
3.200620627477402280e+01 1.472262964233495097e+01
3.215408843347647405e+01 1.468334196973836114e+01
3.230265387006181044e+01 1.464352471003199341e+01
3.245190574156174534e+01 1.460317444081344718e+01
3.260184721959483056e+01 1.456228780704262427e+01
3.275248149043376600e+01 1.452086152262103802e+01
3.290381175507325651e+01 1.447889237193578182e+01
3.305584122929789714e+01 1.443637721132981966e+01
3.320857314375059843e+01 1.439331297051204039e+01
3.336201074400118927e+01 1.434969665390063298e+01
3.351615729061536086e+01 1.430552534189709668e+01
3.367101605922405128e+01 1.426079619208810456e+01
3.382659034059296488e+01 1.421550644037631805e+01
3.398288344069252531e+01 1.416965340202503043e+01
3.413989868076816236e+01 1.412323447263826282e+01
3.429763939741080492e+01 1.407624712904176434e+01
3.445610894262788548e+01 1.402868893009793005e+01
3.461531068391450106e+01 1.398055751742586850e+01
3.477524800432501451e+01 1.393185061603192842e+01
3.493592430254491887e+01 1.388256603485917218e+01
3.509734299296302851e+01 1.383270166724273409e+01
3.525950750574411785e+01 1.378225549127271954e+01
3.542242128690175917e+01 1.373122557006658440e+01
3.558608779837155112e+01 1.367961005194351820e+01
3.575051051808471669e+01 1.362740717051473638e+01
3.591569294004192159e+01 1.357461524466164704e+01
3.608163857438766087e+01 1.352123267843714061e+01
3.624835094748473807e+01 1.346725796085281246e+01
3.641583360198925590e+01 1.341268966558711639e+01
3.658409009692588398e+01 1.335752645057977972e+01
3.675312400776343225e+01 1.330176705754965738e+01
3.692293892649095710e+01 1.324541031139954228e+01
3.709353846169397428e+01 1.318845511953317740e+01
3.726492623863120457e+01 1.313090047108252278e+01
3.743710589931158950e+01 1.307274543603362993e+01
3.761008110257165526e+01 1.301398916426416541e+01
3.778385552415333137e+01 1.295463088448959077e+01
3.795843285678201084e+01 1.289466990311993122e+01
3.813381681024504388e+01 1.283410560302601588e+01
3.831001111147056548e+01 1.277293744222505367e+01
3.848701950460662857e+01 1.271116495247055234e+01
3.866484575110091271e+01 1.264878773777414800e+01
3.884349362978051090e+01 1.258580547283798268e+01
3.902296693693233465e+01 1.252221790140468016e+01
3.920326948638371789e+01 1.245802483454608733e+01
3.938440510958345442e+01 1.239322614886279794e+01
3.956637765568329002e+01 1.232782178462533018e+01
3.974919099161966329e+01 1.226181174383904171e+01
3.993284900219587286e+01 1.219519608825029167e+01
4.011735559016468500e+01 1.212797493728299436e+01
4.030271467631115456e+01 1.206014846592502643e+01
4.048893019953608530e+01 1.199171690255110079e+01
4.067600611693962520e+01 1.192268052669747647e+01
4.086394640390541610e+01 1.185303966678175058e+01
4.105275505418504878e+01 1.178279469778484767e+01
4.124243607998287331e+01 1.171194603887893315e+01
4.143299351204138503e+01 1.164049415102498131e+01
4.162443139972676676e+01 1.156843953452775153e+01
4.181675381111500656e+01 1.149578272656278877e+01
4.200996483307831397e+01 1.142252429866913133e+01
4.220406857137191281e+01 1.134866485421800775e+01
4.239906915072142368e+01 1.127420502586159223e+01
4.259497071491040288e+01 1.119914547295811680e+01
4.279177742686843544e+01 1.112348687898437660e+01
4.298949346875961908e+01 1.104722994893500498e+01
4.318812304207133224e+01 1.097037540671229650e+01
4.338767036770369145e+01 1.089292399251321264e+01
4.358813968605910105e+01 1.081487646021298943e+01
4.378953525713242101e+01 1.073623357474921036e+01
4.399186136060150432e+01 1.065699610951351772e+01
4.419512229591804697e+01 1.057716484374893895e+01
4.439932238239909879e+01 1.049674055996201716e+01
4.460446595931875180e+01 1.041572404134654128e+01
4.481055738600036875e+01 1.033411606922910941e+01
4.501760104190923784e+01 1.025191742053209332e+01
4.522560132674557565e+01 1.016912886526682946e+01
4.543456266053810566e+01 1.008575116404973571e+01
4.564448948373795645e+01 1.000178506565216274e+01
4.585538625731297913e+01 9.917231304585856222e+00
4.606725746284263323e+01 9.832090598723405961e+00
4.628010760261306444e+01 9.746363646960535476e+00
4.649394119971296391e+01 9.660051126923553610e+00
4.670876279812959098e+01 9.573153692722755181e+00
4.692457696284525781e+01 9.485671972755998382e+00
4.714138827993456005e+01 9.397606567566443303e+00
4.735920135666155772e+01 9.308958047756789256e+00
4.757802082157787282e+01 9.219726951963281181e+00
4.779785132462101416e+01 9.129913784893448181e+00
4.801869753721304335e+01 9.039519015429393178e+00
4.824056415236014317e+01 8.948543074803382069e+00
4.846345588475199406e+01 8.856986354843659370e+00
4.868737747086221646e+01 8.764849206300421969e+00
4.891233366904894098e+01 8.672131937250952660e+00
4.913832925965581211e+01 8.578834811588773590e+00
4.936536904511385870e+01 8.484958047603631925e+00
4.959345785004318685e+01 8.390501816651321221e+00
4.982260052135577411e+01 8.295466241922122563e+00
5.005280192835839159e+01 8.199851397309746659e+00
5.028406696285593824e+01 8.103657306387214376e+00
5.051640053925569873e+01 8.006883941491835799e+00
5.074980759467141667e+01 7.909531222927787653e+00
5.098429308902846913e+01 7.811599018289966168e+00
5.121986200516919752e+01 7.713087141913521627e+00
5.145651934895867896e+01 7.613995354459108356e+00
5.169427014939127929e+01 7.514323362635435544e+00
5.193311945869742630e+01 7.414070819070261109e+00
5.217307235245096564e+01 7.313237322334257051e+00
5.241413392967705676e+01 7.211822417126816376e+00
5.265630931296043116e+01 7.109825594631669077e+00
5.289960364855440389e+01 7.007246293051595742e+00
5.314402210649011238e+01 6.904083898330767077e+00
5.338956988068642318e+01 6.800337745075837326e+00
5.363625218906032188e+01 6.696007117685555343e+00
5.388407427363767965e+01 6.591091251701403309e+00
5.413304140066483683e+01 6.485589335390149479e+00
5.438315886072035710e+01 6.379500511573146682e+00
5.463443196882753483e+01 6.272823879715039297e+00
5.488686606456731454e+01 6.165558498287735389e+00
5.514046651219168638e+01 6.057703387425182662e+00
5.539523870073782774e+01 5.949257531886845918e+00
5.565118804414249354e+01 5.840219884347414236e+00
5.590831998135713832e+01 5.730589369033380898e+00
5.616663997646345763e+01 5.620364885726929494e+00
5.642615351878944807e+01 5.509545314160043006e+00
5.668686612302619210e+01 5.398129518822650574e+00
5.694878332934493415e+01 5.286116354210957269e+00
5.721191070351484598e+01 5.173504670543529471e+00
5.747625383702133206e+01 5.060293319974146442e+00
5.774181834718473283e+01 4.946481163333750430e+00
5.800860987727983797e+01 4.832067077434276214e+00
5.827663409665574790e+01 4.717049962971140431e+00
5.854589670085632491e+01 4.601428753062275057e+00
5.881640341174128395e+01 4.485202422464823258e+00
5.908815997760763850e+01 4.368369997513381620e+00
5.936117217331205609e+01 4.250930566826157886e+00
5.963544580039344822e+01 4.132883292828967825e+00
5.991098668719627085e+01 4.014227424150140777e+00
6.018780068899442881e+01 3.894962308942293561e+00
6.046589368811556398e+01 3.775087409191557608e+00
6.074527159406623866e+01 3.654602316077655288e+00
6.102594034365739617e+01 3.533506766453128556e+00
6.130790590113054606e+01 3.411800660513315986e+00
6.159117425828453918e+01 3.289484080734119686e+00
6.187575143460277616e+01 3.166557312158400084e+00
6.216164347738128271e+01 3.043020864116803281e+00
6.244885646185713313e+01 2.918875493474523797e+00
6.273739649133753460e+01 2.794122229499640842e+00
6.302726969732959361e+01 2.668762400454856909e+00
6.331848223967045186e+01 2.542797662019695704e+00
6.361104030665840270e+01 2.416230027655998480e+00
6.390495011518424917e+01 2.289061901034723956e+00
6.420021791086344365e+01 2.161296110649228552e+00
6.449684996816884563e+01 2.032935946744700573e+00
6.479485259056394852e+01 1.903985200699805924e+00
6.509423211063696613e+01 1.774448207002520927e+00
6.539499489023533840e+01 1.644329887967641346e+00
6.569714732060087670e+01 1.513635801348310883e+00
6.600069582250571898e+01 1.382372190999422656e+00
6.630564684638851247e+01 1.250546040755225352e+00
6.661200687249177577e+01 1.118165131686209346e+00
6.691978241099947411e+01 9.852381029047452277e-01
6.722898000217530523e+01 8.517745160897917112e-01
6.753960621650183782e+01 7.177849239025979600e-01
6.785166765481987738e+01 5.832809424624153527e-01
6.816517094846905422e+01 4.482753280517309258e-01
6.848012275942848248e+01 3.127820582120821036e-01
6.879652978045849920e+01 1.768164173867806388e-01
6.911439873524280131e+01 4.039508725417299828e-02
6.943373637853123626e+01 -9.646375811723445493e-02
6.975454949628355905e+01 -2.337403521807630835e-01
7.007684490581348769e+01 -3.714132308001972804e-01
7.040062945593358279e+01 -5.094591220554530731e-01
7.072591002710086627e+01 -6.478528309379156802e-01
7.105269353156283785e+01 -7.865671189515245354e-01
7.138098691350460001e+01 -9.255725786835347080e-01
7.171079714919635251e+01 -1.064837503467513491e+00
7.204213124714141259e+01 -1.204327752329284129e+00
7.237499624822561373e+01 -1.344006610484528297e+00
7.270939922586640591e+01 -1.483834645746614278e+00
7.304534728616351913e+01 -1.623769561308283649e+00
7.338284756804988263e+01 -1.763766045475787081e+00
7.372190724344316948e+01 -1.903775619065837255e+00
7.406253351739854907e+01 -2.043746481326470743e+00
7.440473362826136849e+01 -2.183623355400688304e+00
7.474851484782129774e+01 -2.323347334538488518e+00
7.509388448146674477e+01 -2.462855730455138836e+00
7.544084986833995288e+01 -2.602081925450234756e+00
7.578941838149336263e+01 -2.740955230131269182e+00
7.613959742804573239e+01 -2.879400748827554146e+00
7.649139444933999243e+01 -3.017339255039245494e+00
7.684481692110122708e+01 -3.154687079529752580e+00
7.719987235359535305e+01 -3.291356013939645386e+00
7.755656829178916212e+01 -3.427253233073021654e+00
7.791491231551006535e+01 -3.562281239267356625e+00
7.827491203960768473e+01 -3.696337832508527654e+00
7.863657511411541634e+01 -3.829316110178054622e+00
7.899990922441287466e+01 -3.961104500505177484e+00
7.936492209138964427e+01 -4.091586833943335222e+00
7.973162147160883251e+01 -4.220642456765906658e+00
8.010001515747222811e+01 -4.348146391182842407e+00
8.047011097738587182e+01 -4.473969546189448643e+00
8.084191679592612445e+01 -4.597978983161164379e+00
8.121544051400731234e+01 -4.720038239886566345e+00
8.159069006904903176e+01 -4.840007716266551796e+00
8.196767343514524384e+01 -4.957745124296435435e+00
8.234639862323359694e+01 -5.073106004166558769e+00
8.272687368126548790e+01 -5.185944307373522300e+00
8.310910669437751608e+01 -5.296113046620058995e+00
8.349310578506275249e+01 -5.403465011003087959e+00
8.387887911334374280e+01 -5.507853543569410704e+00
8.426643487694579449e+01 -5.609133376764200207e+00
8.465578131147098873e+01 -5.707161519664817106e+00
8.504692669057365606e+01 -5.801798189190687793e+00
8.543987932613558201e+01 -5.892907775799416825e+00
8.583464756844315957e+01 -5.980359832537898157e+00
8.623123980636458441e+01 -6.064030074814620974e+00
8.662966446752798788e+01 -6.143801376937232384e+00
8.702993001850100541e+01 -6.219564750406329168e+00
8.743204496497010325e+01 -6.291220288219877332e+00
8.783601785192172429e+01 -6.358678059097511159e+00
8.824185726382381745e+01 -6.421858935609712660e+00
8.864957182480793563e+01 -6.480695340740010302e+00
8.905917019885312413e+01 -6.535131898417901652e+00
8.947066108996932599e+01 -6.585125975037864343e+00
8.988405324238284777e+01 -6.630648100886531893e+00
9.029935544072205289e+01 -6.671682262697413712e+00
9.071657651020373692e+01 -6.708226061146880248e+00
9.113572531682129352e+01 -6.740290729936500469e+00
9.155681076753238301e+01 -6.767901016047069618e+00
9.197984181044877516e+01 -6.791094923714437570e+00
9.240482743502627727e+01 -6.809923327544533223e+00
9.283177667225555751e+01 -6.824449462857478999e+00
9.326069859485464519e+01 -6.834748303736835950e+00
9.369160231746096201e+01 -6.840905841280726207e+00
9.412449699682564130e+01 -6.843018276153669532e+00
9.455939183200783305e+01 -6.841191140678688498e+00
9.499629606457000364e+01 -6.835538366379548592e+00
9.543521897877492677e+01 -6.826181313089527691e+00
9.587616990178220533e+01 -6.813247775506088288e+00
9.631915820384702442e+01 -6.796870982442577258e+00
9.676419329851916018e+01 -6.777188603051561344e+00
9.721128464284268489e+01 -6.754341773044133745e+00
9.766044173755760482e+01 -6.728474152466823455e+00
9.811167412730097226e+01 -6.699731024990843054e+00
9.856499140081028543e+01 -6.668258446991080390e+00
9.902040319112704481e+01 -6.634202452990630938e+00
9.947791917580126153e+01 -6.597708322390709590e+00
9.993754907709768531e+01 -6.558919910828196365e+00
1.003993026622015918e+02 -6.517979048037995327e+00
1.008631897434271849e+02 -6.475025002783646677e+00
1.013292201784253876e+02 -6.430194014254952961e+00
1.017974038703936088e+02 -6.383618888341525022e+00
1.022677507682865325e+02 -6.335428656366445921e+00
1.027402708670267941e+02 -6.285748293205583259e+00
1.032149742077181571e+02 -6.234698491213052307e+00
1.036918708778582783e+02 -6.182395486017705721e+00
1.041709710115532204e+02 -6.128950930020417687e+00
1.046522847897332582e+02 -6.074471809306146497e+00
1.051358224403684005e+02 -6.019060399665690397e+00
1.056215942386866260e+02 -5.962814257481455549e+00
1.061096105073914941e+02 -5.905826241356014528e+00
1.065998816168817740e+02 -5.848184560542723176e+00
1.070924179854721672e+02 -5.789972846451060917e+00
1.075872300796139740e+02 -5.731270243744138071e+00
1.080843284141183176e+02 -5.672151517804145726e+00
1.085837235523788706e+02 -5.612687175613187307e+00
1.090854261065967421e+02 -5.552943597364330408e+00
1.095894467380057620e+02 -5.492983176388062994e+00
1.100957961570993717e+02 -5.432864465237603468e+00
1.106044851238580122e+02 -5.372642326021049186e+00
1.111155244479775774e+02 -5.312368083308285804e+00
1.116289249890993460e+02 -5.252089678152006336e+00
1.121446976570406662e+02 -5.191851821969422076e+00
1.126628534120270473e+02 -5.131696149213615499e+00
1.131834032649248627e+02 -5.071661367931281639e+00
1.137063582774750898e+02 -5.011783407459501127e+00
1.142317295625287130e+02 -4.952095562643371807e+00
1.147595282842826947e+02 -4.892628634085067318e+00
1.152897656585174815e+02 -4.833411064035358251e+00
1.158224529528351781e+02 -4.774469067636889719e+00
1.163576014868987158e+02 -4.715826759306638749e+00
1.168952226326727697e+02 -4.657506274119590728e+00
1.174353278146651292e+02 -4.599527884112390552e+00
1.179779285101698889e+02 -4.541910109480498114e+00
1.185230362495110654e+02 -4.484669824683032324e+00
1.190706626162874215e+02 -4.427822359510068750e+00
1.196208192476188970e+02 -4.371381595192112002e+00
1.201735178343937491e+02 -4.315360055659256844e+00
1.207287701215172859e+02 -4.259768994076529758e+00
1.212865879081612519e+02 -4.204618474796292915e+00
1.218469830480142519e+02 -4.149917450880970193e+00
1.224099674495340793e+02 -4.095673837356613056e+00
1.229755530762004838e+02 -4.041894580364935763e+00
1.235437519467697882e+02 -3.988585722384149435e+00
1.241145761355300294e+02 -3.935752463689210945e+00
1.246880377725572941e+02 -3.883399220224494464e+00
1.252641490439738590e+02 -3.831529678057016941e+00
1.258429221922068990e+02 -3.780146844579155729e+00
1.264243695162489871e+02 -3.729253096622957120e+00
1.270085033719192609e+02 -3.678850225646379979e+00
1.275953361721256698e+02 -3.628939480145994434e+00
1.281848803871291409e+02 -3.579521605445321608e+00
1.287771485448083979e+02 -3.530596881002805443e+00
1.293721532309265569e+02 -3.482165155377386689e+00
1.299699070893977932e+02 -3.434225878984988878e+00
1.305704228225569636e+02 -3.386778134771081028e+00
1.311737131914287318e+02 -3.339820666921594849e+00
1.317797910159990238e+02 -3.293351907725934780e+00
1.323886691754879052e+02 -3.247370002701858827e+00
1.330003606086223726e+02 -3.201872834086327391e+00
1.336148783139122997e+02 -3.156858042789410845e+00
1.342322353499257588e+02 -3.112323048906511680e+00
1.348524448355668710e+02 -3.068265070873778644e+00
1.354755199503550500e+02 -3.024681143353553203e+00
1.361014739347041598e+02 -2.981568133925165398e+00
1.367303200902047990e+02 -2.938922758656921097e+00
1.373620717799061595e+02 -2.896741596628953808e+00
1.379967424286003848e+02 -2.855021103471329535e+00
1.386343455231081521e+02 -2.813757623981071987e+00
1.392748946125644522e+02 -2.772947403875161587e+00
1.399184033087074965e+02 -2.732586600734261406e+00
1.405648852861670832e+02 -2.692671294189014297e+00
1.412143542827554654e+02 -2.653197495396779182e+00
1.418668240997599526e+02 -2.614161155854446861e+00
1.425223086022349150e+02 -2.575558175589823584e+00
1.431808217192977963e+02 -2.537384410771181820e+00
1.438423774444238745e+02 -2.499635680773039770e+00
1.445069898357442923e+02 -2.462307774732700238e+00
1.451746730163450820e+02 -2.425396457630976776e+00
1.458454411745662753e+02 -2.388897475927503233e+00
1.465193085643046231e+02 -2.352806562780167976e+00
1.471962895053154341e+02 -2.317119442875101853e+00
1.478763983835173406e+02 -2.281831836893216003e+00
1.485596496512984004e+02 -2.246939465636622391e+00
1.492460578278221703e+02 -2.212438053837558982e+00
1.499356374993375596e+02 -2.178323333670747708e+00
1.506284033194875462e+02 -2.144591047988003929e+00
1.513243700096211342e+02 -2.111236953294672425e+00
1.520235523591066169e+02 -2.078256822483783406e+00
1.527259652256448419e+02 -2.045646447344673380e+00
1.534316235355860556e+02 -2.013401640860882580e+00
1.541405422842460951e+02 -1.981518239311526486e+00
1.548527365362254216e+02 -1.949992104189103514e+00
1.555682214257298313e+02 -1.918819123945884275e+00
1.562870121568908530e+02 -1.887995215581288910e+00
1.570091240040902107e+02 -1.857516326079855729e+00
1.577345723122831487e+02 -1.827378433710476813e+00
1.584633724973250821e+02 -1.797577549196759605e+00
1.591955400462997261e+02 -1.768109716766475215e+00
1.599310905178469397e+02 -1.738971015089006755e+00
1.606700395424947203e+02 -1.710157558108299281e+00
1.614124028229901739e+02 -1.681665495778601693e+00
1.621581961346337550e+02 -1.653491014709744578e+00
1.629074353256149266e+02 -1.625630338728203395e+00
1.636601363173478205e+02 -1.598079729360334378e+00
1.644163151048108489e+02 -1.570835486242512680e+00
1.651759877568854620e+02 -1.543893947464133110e+00
1.659391704166981469e+02 -1.517251489848066015e+00
1.667058793019639324e+02 -1.490904529172542015e+00
1.674761307053298083e+02 -1.464849520340139266e+00
1.682499409947223796e+02 -1.439082957495995352e+00
1.690273266136944699e+02 -1.413601374100590613e+00
1.698083040817749634e+02 -1.388401342959259877e+00
1.705928899948205242e+02 -1.363479476213039776e+00
1.713811010253669735e+02 -1.338832425292427075e+00
1.721729539229849308e+02 -1.314456880838054120e+00
1.729684655146345449e+02 -1.290349572590215654e+00
1.737676527050237212e+02 -1.266507269250203516e+00
1.745705324769676281e+02 -1.242926778315220249e+00
1.753771218917485442e+02 -1.219604945889802172e+00
1.761874380894798549e+02 -1.196538656474928519e+00
1.770014982894687989e+02 -1.173724832737305324e+00
1.778193197905831937e+02 -1.151160435260241588e+00
1.786409199716193825e+02 -1.128842462278068393e+00
1.794663162916704096e+02 -1.106767949395276673e+00
1.802955262904983726e+02 -1.084933969292134037e+00
1.811285675889058950e+02 -1.063337631417997864e+00
1.819654578891111782e+02 -1.041976081673233301e+00
1.828062149751246750e+02 -1.020846502081676821e+00
1.836508567131256484e+02 -9.999461104538419631e-01
1.844994010518435061e+02 -9.792721600426911310e-01
1.853518660229376849e+02 -9.588219391920395074e-01
1.862082697413815424e+02 -9.385927709793456808e-01
1.870686304058477560e+02 -9.185820128530699513e-01
1.879329662990938346e+02 -8.987870562657371831e-01
1.888012957883520926e+02 -8.792053263028982713e-01
1.896736373257185733e+02 -8.598342813096654380e-01
1.905500094485458362e+02 -8.406714125138872173e-01
1.914304307798373372e+02 -8.217142436482380852e-01
1.923149200286419500e+02 -8.029603305701876748e-01
1.932034959904529501e+02 -7.844072608815445546e-01
1.940961775476061462e+02 -7.660526535472826914e-01
1.949929836696817631e+02 -7.478941585142750981e-01
1.958939334139079449e+02 -7.299294563305935846e-01
1.967990459255645419e+02 -7.121562577651141535e-01
1.977083404383915024e+02 -6.945723034284143615e-01
1.986218362749960420e+02 -6.771753633948295326e-01
1.995395528472640478e+02 -6.599632368260075488e-01
2.004615096567731030e+02 -6.429337515965201089e-01
2.013877262952054537e+02 -6.260847639213058535e-01
2.023182224447659792e+02 -6.094141579852846435e-01
2.032530178785990529e+02 -5.929198455758986075e-01
2.041921324612093258e+02 -5.765997657176820113e-01
2.051355861488844141e+02 -5.604518843101088388e-01
2.060833989901175300e+02 -5.444741937680591670e-01
2.070355911260352855e+02 -5.286647126655413809e-01
2.079921827908241028e+02 -5.130214853824498489e-01
2.089531943121608606e+02 -4.975425817548098650e-01
2.099186461116455575e+02 -4.822260967282449573e-01
2.108885587052337200e+02 -4.670701500148329854e-01
2.118629527036740399e+02 -4.520728857538768297e-01
2.128418488129449599e+02 -4.372324721758823474e-01
2.138252678346952393e+02 -4.225471012702968765e-01
2.148132306666867066e+02 -4.080149884572200625e-01
2.158057583032367575e+02 -3.936343722624376928e-01
2.168028718356662239e+02 -3.794035139966102088e-01
2.178045924527461352e+02 -3.653206974381589811e-01
2.188109414411485147e+02 -3.513842285197225079e-01
2.198219401858994786e+02 -3.375924350190399048e-01
2.208376101708320789e+02 -3.239436662530060795e-01
2.218579729790445754e+02 -3.104362927761287194e-01
2.228830502933576554e+02 -2.970687060826616155e-01
2.239128638967756899e+02 -2.838393183125277330e-01
2.249474356729504052e+02 -2.707465619610789909e-01
2.259867876066443557e+02 -2.577888895929785762e-01
2.270309417841998254e+02 -2.449647735596965914e-01
2.280799203940066491e+02 -2.322727057206481760e-01
2.291337457269743254e+02 -2.197111971685125065e-01
2.301924401770064890e+02 -2.072787779581953260e-01
2.312560262414750980e+02 -1.949739968393025824e-01
2.323245265217003919e+02 -1.827954209927594720e-01
2.333979637234295126e+02 -1.707416357707004506e-01
2.344763606573197308e+02 -1.588112444403715351e-01
2.355597402394238884e+02 -1.470028679314697717e-01
2.366481254916756427e+02 -1.353151445872679270e-01
2.377415395423806785e+02 -1.237467299189886072e-01
2.388400056267065281e+02 -1.122962963641498946e-01
2.399435470871768814e+02 -1.009625330480277833e-01
2.410521873741685397e+02 -8.974414554891985141e-02
2.421659500464079144e+02 -7.863985566643548475e-02
2.432848587714736368e+02 -6.764840119367798721e-02
2.444089373262977745e+02 -5.676853569230715102e-02
2.455382095976718517e+02 -4.599902827115261855e-02
2.466726995827552287e+02 -3.533866336822516496e-02
2.478124313895831676e+02 -2.478624053555980936e-02
2.489574292375812661e+02 -1.434057422767680626e-02
2.501077174580782980e+02 -4.000493592920328217e-03
2.512633204948243133e+02 6.235157731954076195e-03
2.524242629045095043e+02 1.636752182417228890e-02
2.535905693572868245e+02 2.639772667433106998e-02
2.547622646372957433e+02 3.632688638272415366e-02
2.559393736431883610e+02 4.615610135282797316e-02
2.571219213886593025e+02 5.588645848164139340e-02
2.583099330029768339e+02 6.551903134759744229e-02
2.595034337315174184e+02 7.505488039520642751e-02
2.607024489363018347e+02 8.449505311709334943e-02
2.619070040965335693e+02 9.384058423328990595e-02
2.631171248091411030e+02 1.030924958679286518e-01
2.643328367893210498e+02 1.122517977230585162e-01
2.655541658710858428e+02 1.213194872498757210e-01
2.667811380078117622e+02 1.302965498176055226e-01
2.680137792727901456e+02 1.391839588794436811e-01
2.692521158597822364e+02 1.479826761363991772e-01
2.704961740835751129e+02 1.566936516982904704e-01
2.717459803805418801e+02 1.653178242426552869e-01
2.730015613092027706e+02 1.738561211709057086e-01
2.742629435507891458e+02 1.823094587623676488e-01
2.755301539098110197e+02 1.906787423260396241e-01
2.768032193146263467e+02 1.989648663498149173e-01
2.780821668180139454e+02 2.071687146476874908e-01
2.793670235977479592e+02 2.152911605045104426e-01
2.806578169571746457e+02 2.233330668188748258e-01
2.819545743257936010e+02 2.312952862436156165e-01
2.832573232598397794e+02 2.391786613241545234e-01
2.845660914428704018e+02 2.469840246349572499e-01
2.858809066863522617e+02 2.547121989139541354e-01
2.872017969302521578e+02 2.623639971945981308e-01
2.885287902436318177e+02 2.699402229363728756e-01
2.898619148252433320e+02 2.774416701530959539e-01
2.912011990041297622e+02 2.848691235394080201e-01
2.925466712402260328e+02 2.922233585952482282e-01
2.938983601249634603e+02 2.995051417486260803e-01
2.952562943818782628e+02 3.067152304764632076e-01
2.966205028672209210e+02 3.138543734236376448e-01
2.979910145705707691e+02 3.209233105203723180e-01
2.993678586154511549e+02 3.279227730976373989e-01
3.007510642599477251e+02 3.348534840011552771e-01
3.021406608973311450e+02 3.417161577034291686e-01
3.035366780566811258e+02 3.485115004142826933e-01
3.049391454035146580e+02 3.552402101897499387e-01
3.063480927404160070e+02 3.619029770392754308e-01
3.077635500076693233e+02 3.685004830314189128e-01
3.091855472838957439e+02 3.750334023979461917e-01
3.106141147866920278e+02 3.815024016365262116e-01
3.120492828732736257e+02 3.879081396115896530e-01
3.134910820411190571e+02 3.942512676541832795e-01
3.149395429286173567e+02 4.005324296599109823e-01
3.163946963157203527e+02 4.067522621858367105e-01
3.178565731245956272e+02 4.129113945455646917e-01
3.193252044202850470e+02 4.190104489033150692e-01
3.208006214113640340e+02 4.250500403664824178e-01
3.222828554506040177e+02 4.310307770767382030e-01
3.237719380356398915e+02 4.369532602999218196e-01
3.252679008096384905e+02 4.428180845147332567e-01
3.267707755619721297e+02 4.486258374999003706e-01
3.282805942288933352e+02 4.543771004203052133e-01
3.297973888942130429e+02 4.600724479117498933e-01
3.313211917899830610e+02 4.657124481645668612e-01
3.328520352971807483e+02 4.712976630060238814e-01
3.343899519463977299e+02 4.768286479814127787e-01
3.359349744185306577e+02 4.823059524342166449e-01
3.374871355454752120e+02 4.877301195850065607e-01
3.390464683108243094e+02 4.931016866090520145e-01
3.406130058505689249e+02 4.984211847132798967e-01
3.421867814538027233e+02 5.036891392114926091e-01
3.437678285634291910e+02 5.089060695991851624e-01
3.453561807768712129e+02 5.140724896268232813e-01
3.469518718467865597e+02 5.191889073722766312e-01
3.485549356817838884e+02 5.242558253122440171e-01
3.501654063471447103e+02 5.292737403926091044e-01
3.517833180655465526e+02 5.342431440978041568e-01
3.534087052177893611e+02 5.391645225193105739e-01
3.550416023435272450e+02 5.440383564230395486e-01
3.566820441420016436e+02 5.488651213158519671e-01
3.583300654727799497e+02 5.536452875111699257e-01
3.599857013564953263e+02 5.583793201936035899e-01
3.616489869755903896e+02 5.630676794828035625e-01
3.633199576750657798e+02 5.677108204962154625e-01
3.649986489632304938e+02 5.723091934111914636e-01
3.666850965124577897e+02 5.768632435261416003e-01
3.683793361599422269e+02 5.813734113207497112e-01
3.700814039084604588e+02 5.858401325155672135e-01
3.717913359271377089e+02 5.902638381305218562e-01
3.735091685522152716e+02 5.946449545429878247e-01
3.752349382878239794e+02 5.989839035446821169e-01
3.769686818067591503e+02 6.032811023978997822e-01
3.787104359512591145e+02 6.075369638912132553e-01
3.804602377337891994e+02 6.117518963940858923e-01
3.822181243378276463e+02 6.159263039110227655e-01
3.839841331186565867e+02 6.200605861347376901e-01
3.857583016041555766e+02 6.241551384988158757e-01
3.875406674955978019e+02 6.282103522295329201e-01
3.893312686684527080e+02 6.322266143971599917e-01
3.911301431731898788e+02 6.362043079662643708e-01
3.929373292360889423e+02 6.401438118458315785e-01
3.947528652600511236e+02 6.440455009382317630e-01
3.965767898254143233e+02 6.479097461879050890e-01
3.984091416907743337e+02 6.517369146292745219e-01
4.002499597938074771e+02 6.555273694340828516e-01
4.020992832520994398e+02 6.592814699581099891e-01
4.039571513639757541e+02 6.629995717873615746e-01
4.058236036093356915e+02 6.666820267837647584e-01
4.076986796504928634e+02 6.703291831301061432e-01
4.095824193330171283e+02 6.739413853746707428e-01
4.114748626865823553e+02 6.775189744753256083e-01
4.133760499258164600e+02 6.810622878431025207e-01
4.152860214511550225e+02 6.845716593853456988e-01
4.172048178497010440e+02 6.880474195486048217e-01
4.191324798960866360e+02 6.914898953608255017e-01
4.210690485533408491e+02 6.948994104736982980e-01
4.230145649737589792e+02 6.982762852043179480e-01
4.249690704997766488e+02 7.016208365768848987e-01
4.269326066648491746e+02 7.049333783643334517e-01
4.289052151943335502e+02 7.082142211297788315e-01
4.308869380063765107e+02 7.114636722681095815e-01
4.328778172128041319e+02 7.146820360480921064e-01
4.348778951200160350e+02 7.178696136546390827e-01
4.368872142298857284e+02 7.210267032319428449e-01
4.389058172406627705e+02 7.241535999276251800e-01
4.409337470478815817e+02 7.272505959384378826e-01
4.429710467452719058e+02 7.303179805578950967e-01
4.450177596256739321e+02 7.333560402265932865e-01
4.470739291819593859e+02 7.363650585865298970e-01
4.491395991079548367e+02 7.393453165404557659e-01
4.512148132993718832e+02 7.422970923182198311e-01
4.532996158547386472e+02 7.452206615528063072e-01
4.553940510763360408e+02 7.481162973700359320e-01
4.574981634711408560e+02 7.509842704970716154e-01
4.596119977517702750e+02 7.538248493982753207e-01
4.617355988374335425e+02 7.566383004502130749e-01
4.638690118548855708e+02 7.594248881753951075e-01
4.660122821393849790e+02 7.621848755641082995e-01
4.681654552356589534e+02 7.649185245333720573e-01
4.703285768988698123e+02 7.676260966057567581e-01
4.725016930955890757e+02 7.703078539500997080e-01
4.746848500047732955e+02 7.729640610470980278e-01
4.768780940187441502e+02 7.755949874795802224e-01
4.790814717441759285e+02 7.782009128675748677e-01
4.812950300030848894e+02 7.807821361812460337e-01
4.835188158338257267e+02 7.833389947831670419e-01
4.857528764920901381e+02 7.858719076129363490e-01
4.879972594519101108e+02 7.883814878745422083e-01
4.902520124066680296e+02 7.908689037166484193e-01
4.925171832701093990e+02 7.933374928318425168e-01
4.947928201773623869e+02 7.958077255746899281e-01
4.970789714859597552e+02 7.980048299633408782e-01
4.993756857768653958e+02 8.005172605697546961e-01
5.016830118555083118e+02 8.028988822892767496e-01
5.040009987528184752e+02 8.052488460834729134e-01
5.063296957262706428e+02 8.075737158480277289e-01
5.086691522609297067e+02 8.098752388237767663e-01
5.110194180705014446e+02 8.121541823474385247e-01
5.133805430983904898e+02 8.144110059722542427e-01
5.157525775187602903e+02 8.166460462236333484e-01
5.181355717376012535e+02 8.188595818412156557e-01
5.205295763938009941e+02 8.210518609332602136e-01
5.229346423602185041e+02 8.232231136912901981e-01
5.253508207447677023e+02 8.253735588997768158e-01
5.277781628915021201e+02 8.275034075128772093e-01
5.302167203817073187e+02 8.296128647360812014e-01
5.326665450349962612e+02 8.317021312983824410e-01
5.351276889104091197e+02 8.337714042625945510e-01
5.376002043075216079e+02 8.358208775608401142e-01
5.400841437675545649e+02 8.378507423608401172e-01
5.425795600744929743e+02 8.398611873238439607e-01
5.450865062562056664e+02 8.418523987918696827e-01
5.476050355855716134e+02 8.438245609272390091e-01
5.501352015816136145e+02 8.457778558195419016e-01
5.526770580106340276e+02 8.477124635693993326e-01
5.552306588873597093e+02 8.496285623561684597e-01
5.577960584760879783e+02 8.515263284933312082e-01
5.603733112918391726e+02 8.534059364754893462e-01
5.629624721015163686e+02 8.552675590185566668e-01
5.655635959250682845e+02 8.571113670947132501e-01
5.681767380366603675e+02 8.589375299640279460e-01
5.708019539658475878e+02 8.607462152025755486e-01
5.734392994987540533e+02 8.625375887283588394e-01
5.760888306792596723e+02 8.643118148253949862e-01
5.787506038101901140e+02 8.660690561660711051e-01
5.814246754545151816e+02 8.678094738323528512e-01
5.841111024365491176e+02 8.695332273359134279e-01
5.868099418431575032e+02 8.712404746371951170e-01
5.895212510249717752e+02 8.729313721641878132e-01
5.922450875976069256e+02 8.746060748299079313e-01
5.949815094428881821e+02 8.762647360498166949e-01
5.977305747100765529e+02 8.779075077585343223e-01
6.004923418171099456e+02 8.795345404260911382e-01
6.032668694518395114e+02 8.811459830739348797e-01
6.060542165732792910e+02 8.827419832903594665e-01
6.088544424128606352e+02 8.843226872457848886e-01
6.116676064756863980e+02 8.858882397076188742e-01
6.144937685418008186e+02 8.874387840549913253e-01
6.173329886674549698e+02 8.889744622929960371e-01
6.201853271863853934e+02 8.904954150669135426e-01
6.230508447110977386e+02 8.920017816760617002e-01
6.259296021341501728e+02 8.934937000874905166e-01
6.288216606294530493e+02 8.949713069494213968e-01
6.317270816535639142e+02 8.964347376045321836e-01
6.346459269469953597e+02 8.978841261030103826e-01
6.375782585355292440e+02 8.993196052154623921e-01
6.405241387315301154e+02 9.007413064457198137e-01
6.434836301352744385e+02 9.021493600431246263e-01
6.464567956362761834e+02 9.035438950151354343e-01
6.494436984146258283e+02 9.049250391395159410e-01
6.524444019423340251e+02 9.062929189761943505e-01
6.554589699846765143e+02 9.076476598794520623e-01
6.584874666015538196e+02 9.089893860093468669e-01
6.615299561488485551e+02 9.103182203436288589e-01
6.645865032797944423e+02 9.116342846889781137e-01
6.676571729463522615e+02 9.129376996924551957e-01
6.707420304005858043e+02 9.142285848526041647e-01
6.738411411960535133e+02 9.155070585304856401e-01
6.769545711891967130e+02 9.167732379606864379e-01
6.800823865407412541e+02 9.180272392620637545e-01
6.832246537171057525e+02 9.192691774483509048e-01
6.863814394918085782e+02 9.204991664388063599e-01
6.895528109468929188e+02 9.217173190685192807e-01
6.927388354743469563e+02 9.229237470988383985e-01
6.959395807775383673e+02 9.241185612272990735e-01
6.991551148726551901e+02 9.253018710980303041e-01
7.023855060901456682e+02 9.264737853114296540e-01
7.056308230761767391e+02 9.276344114341434910e-01
7.088911347940871792e+02 9.287838560087728901e-01
7.121665105258556423e+02 9.299222245634065631e-01
7.154570198735747226e+02 9.310496216212282850e-01
7.187627327609252461e+02 9.321661507099423538e-01
7.220837194346676142e+02 9.332719143710079823e-01
7.254200504661297373e+02 9.343670141688765751e-01
7.287717967527089513e+02 9.354515507000971120e-01
7.321390295193805287e+02 9.365256236023338232e-01
7.355218203202061886e+02 9.375893315632395364e-01
7.389202410398605707e+02 9.386427723293677694e-01
7.423343638951535013e+02 9.396860427147063488e-01
7.457642614365668123e+02 9.407192386095063474e-01
7.492100065497986634e+02 9.417424549887555285e-01
7.526716724573066131e+02 9.427557859205660806e-01
7.561493327198699035e+02 9.437593245746265236e-01
7.596430612381473111e+02 9.447531632303597382e-01
7.631529322542497766e+02 9.457373932852121134e-01
7.666790203533204249e+02 9.467121052627820443e-01
7.702214004651139021e+02 9.476773888207015162e-01
7.737801478655951541e+02 9.486333327586792263e-01
7.773553381785336569e+02 9.495800250263877196e-01
7.809470473771120851e+02 9.505175527310695260e-01
7.845553517855439623e+02 9.514460021455120042e-01
7.881803280806896055e+02 9.523654587154060103e-01
7.918220532936918516e+02 9.532760070670383001e-01
7.954806048116074635e+02 9.541777310146813962e-01
7.991560603790539972e+02 9.550707135681218984e-01
8.028484980998645142e+02 9.559550369397818992e-01
8.065579964387411565e+02 9.568307825521884524e-01
8.102846342229295260e+02 9.576980310449774159e-01
8.140284906438878352e+02 9.585568622821531992e-01
8.177896452589729961e+02 9.594073553589956838e-01
8.215681779931294386e+02 9.602495886091517718e-01
8.253641691405904339e+02 9.610836396115317593e-01
8.291776993665823738e+02 9.619095851969977629e-01
8.330088497090371220e+02 9.627275014554710353e-01
8.368577015803169843e+02 9.635374637422987609e-01
8.407243367689428624e+02 9.643395466852004994e-01
8.446088374413345718e+02 9.651338241907042592e-01
8.485112861435554805e+02 9.659203694507495497e-01
8.524317658030651046e+02 9.666992549492139375e-01
8.563703597304831874e+02 9.674705524683490099e-01
8.603271516213591212e+02 9.682343330951032057e-01
8.643022255579525108e+02 9.689906672276078492e-01
8.682956660110186249e+02 9.697396245813555415e-01
8.723075578416012377e+02 9.704812741956516664e-01
8.763379863028389991e+02 9.712156844396412358e-01
8.803870370417749882e+02 9.719429230187330848e-01
8.844547961011795678e+02 9.726630569808947246e-01
8.885413499213766499e+02 9.733761527225537336e-01
8.926467853420796246e+02 9.740822759953154941e-01
8.967711896042383160e+02 9.747814919119602850e-01
9.009146503518918507e+02 9.754738649530808603e-01
9.050772556340334631e+02 9.761594589735673733e-01
9.092590939064800750e+02 9.768383372094961992e-01
9.134602540337494929e+02 9.775105622852754417e-01
9.176808252909523844e+02 9.781761962212245365e-01
9.219208973656868693e+02 9.788353004420917713e-01
9.261805603599475489e+02 9.794879357866109748e-01
9.304599047920379462e+02 9.801341625184851747e-01
9.347590215984928363e+02 9.807740403405569296e-01
9.390780021360127421e+02 9.814076284125207161e-01
9.434169381834036585e+02 9.820349853759471337e-01
9.477759219435303066e+02 9.826561693906850081e-01
9.521550460452737070e+02 9.832712381921632216e-01
9.565544035454971663e+02 9.838802491866870392e-01
9.609740879310269293e+02 9.844832596240622458e-01
9.654141931206368099e+02 9.850803269345764779e-01
9.698748134670468062e+02 9.856715094581630643e-01
9.743560437589263756e+02 9.862568682369631246e-01
9.788579792229064651e+02 9.868364722857561055e-01
9.833807155256064334e+02 9.874104190159256333e-01
9.879243487756642708e+02 9.879789676121626396e-01
9.924889755257828483e+02 9.885521224763293979e-01
9.970746927747788959e+02 9.890963964274248621e-01
1.001681597969642667e+03 9.896483454085558407e-01
1.006309789007611471e+03 9.901944382176059989e-01
1.010959364238248213e+03 9.907350188831194338e-01
1.015630422465534252e+03 9.912701918821743563e-01
1.020323062949966925e+03 9.918000242027159574e-01
1.025037385410666730e+03 9.923245720928777214e-01
1.029773490027499747e+03 9.928438875367556760e-01
1.034531477443204039e+03 9.933580203750231874e-01
1.039311448765531622e+03 9.938670191448377711e-01
1.044113505569395102e+03 9.943709314605374550e-01
1.048937749899023856e+03 9.948698042044772372e-01
1.053784284270135458e+03 9.953636836313518588e-01
1.058653211672112320e+03 9.958526154292169918e-01
1.063544635570193350e+03 9.963366447576249563e-01
1.068458659907670608e+03 9.968158162727625005e-01
1.073395389108095287e+03 9.972901741453289448e-01
1.078354928077501199e+03 9.977597620734983686e-01
1.083337382206630537e+03 9.982246232930748198e-01
1.088342857373177594e+03 9.986848005857716926e-01
1.093371459944036360e+03 9.991403362862221194e-01
1.098423296777557880e+03 9.995912722880393453e-01
1.103498475225825814e+03 1.000037650049159232e+00
1.108597103136934038e+03 1.000479510597028110e+00
1.113719288857281981e+03 1.000916894533210755e+00
1.118865141233875647e+03 1.001349842037751126e+00
1.124034769616637732e+03 1.001778392873532653e+00
1.129228283860734791e+03 1.002202586390043226e+00
1.134445794328908732e+03 1.002622461527694853e+00
1.139687411893827402e+03 1.003038056821535129e+00
1.144953247940435858e+03 1.003449410404735120e+00
1.150243414368322874e+03 1.003856560012544197e+00
1.155558023594101542e+03 1.004259542985929343e+00
1.160897188553795786e+03 1.004658396274772603e+00
1.166261022705243931e+03 1.005053156441741535e+00
1.171649640030507271e+03 1.005443859665438922e+00
1.177063155038290233e+03 1.005830541743969686e+00
1.182501682766376462e+03 1.006213238098186524e+00
1.187965338784071491e+03 1.006591983775100063e+00
1.193454239194662250e+03 1.006966813450863585e+00
1.198968500637882016e+03 1.007337761434411672e+00
1.204508240292385835e+03 1.007704861670297936e+00
1.210073575878245038e+03 1.008068147741959741e+00
1.215664625659446074e+03 1.008427652874883229e+00
1.221281508446407543e+03 1.008783409939647768e+00
1.226924343598501309e+03 1.009135451454906685e+00
1.232593251026588632e+03 1.009483809590468573e+00
1.238288351195569703e+03 1.009828516170295565e+00
1.244009765126942511e+03 1.010169602675281331e+00
1.249757614401377850e+03 1.010507100246489598e+00
1.255532021161300236e+03 1.010841039687656817e+00
1.261333108113481330e+03 1.011171451468358740e+00
1.267160998531651103e+03 1.011498365726567927e+00
1.273015816259114445e+03 1.011821812271687104e+00
1.278897685711387567e+03 1.012141820587165064e+00
1.284806731878838264e+03 1.012458419833205614e+00
1.290743080329340501e+03 1.012771638849644606e+00
1.296706857210945600e+03 1.013081506158437950e+00
1.302698189254560702e+03 1.013388049966340354e+00
1.308717203776646102e+03 1.013691298167633370e+00
1.314764028681917125e+03 1.013991278346626057e+00
1.320838792466061250e+03 1.014288017780341944e+00
1.326941624218470224e+03 1.014581543440733258e+00
1.333072653624982877e+03 1.014871881997747805e+00
1.339232010970643159e+03 1.015159059821356902e+00
1.345419827142467511e+03 1.015443102984223467e+00
1.351636233632222229e+03 1.015724037264243762e+00
1.357881362539222664e+03 1.016001888146895515e+00
1.364155346573137194e+03 1.016276680827761014e+00
1.370458319056811661e+03 1.016548440214988025e+00
1.376790413929099486e+03 1.016817190931848414e+00
1.383151765747705213e+03 1.017082957319140002e+00
1.389542509692048270e+03 1.017345763438040951e+00
1.395962781566132207e+03 1.017605633072729443e+00
1.402412717801435520e+03 1.017862589733503853e+00
1.408892455459807479e+03 1.018116656660144059e+00
1.415402132236378065e+03 1.018367856825903139e+00
1.421941886462487901e+03 1.018616212942921262e+00
1.428511857108625463e+03 1.018861747469232526e+00
1.435112183787384311e+03 1.019104482619737295e+00
1.441743006756427349e+03 1.019344440385223427e+00
1.448404466921463154e+03 1.019581642567027435e+00
1.455096705839246624e+03 1.019816110851904156e+00
1.461819865720582357e+03 1.020047866994564290e+00
1.468574089433351674e+03 1.020276933357633808e+00
1.475359520505546243e+03 1.020503335038101422e+00
1.482176303128314203e+03 1.020727114323905393e+00
1.489024582159028796e+03 1.020950899957382418e+00
1.495904503124364510e+03 1.021166519129466987e+00
1.502816212223392540e+03 1.021382466989715132e+00
1.509759856330686489e+03 1.021595808354822221e+00
1.516735582999438293e+03 1.021806587612613670e+00
1.523743540464600073e+03 1.022014828539344222e+00
1.530783877646029850e+03 1.022220551372776898e+00
1.537856744151661360e+03 1.022423775181003691e+00
1.544962290280680236e+03 1.022624518448556730e+00
1.552100667026714518e+03 1.022822799271293714e+00
1.559272026081047670e+03 1.023018635434824297e+00
1.566476519835839554e+03 1.023212044451080383e+00
1.573714301387369005e+03 1.023403043577117311e+00
1.580985524539284370e+03 1.023591649825963623e+00
1.588290343805868133e+03 1.023777879973427396e+00
1.595628914415326108e+03 1.023961750562959017e+00
1.603001392313081169e+03 1.024143277908790894e+00
1.610407934165094275e+03 1.024322478098857125e+00
1.617848697361187760e+03 1.024499366997101424e+00
1.625323840018389319e+03 1.024673960245192639e+00
1.632833520984294637e+03 1.024846273264521157e+00
1.640377899840440932e+03 1.025016321257723462e+00
1.647957136905702555e+03 1.025184119210220901e+00
1.655571393239694771e+03 1.025349681891781328e+00
1.663220830646192553e+03 1.025513023857552497e+00
1.670905611676574608e+03 1.025674159449788014e+00
1.678625899633273093e+03 1.025833102798952901e+00
1.686381858573250383e+03 1.025989867824846469e+00
1.694173653311480621e+03 1.026144468238101348e+00
1.702001449424449447e+03 1.026296917541075437e+00
1.709865413253677161e+03 1.026447229029119779e+00
1.717765711909250058e+03 1.026595415791752952e+00
1.725702513273377690e+03 1.026741490713576344e+00
1.733675986003955131e+03 1.026885466475559783e+00
1.741686299538145022e+03 1.027027355555886645e+00
1.749733624095983032e+03 1.027167170231026772e+00
1.757818130683991058e+03 1.027304922576756541e+00
1.765939991098816790e+03 1.027440624469116326e+00
1.774099377930880792e+03 1.027574287585250268e+00
1.782296464568040619e+03 1.027705923404505173e+00
1.790531425199280420e+03 1.027835543209112190e+00
1.798804434818409163e+03 1.027963158085151374e+00
1.807115669227784338e+03 1.028088778923441859e+00
1.815465305042044974e+03 1.028212416420320796e+00
1.823853519691859901e+03 1.028334081078430717e+00
1.832280491427704419e+03 1.028453783207569749e+00
1.840746399323644482e+03 1.028571532925395715e+00
1.849251423281147027e+03 1.028687340158259023e+00
1.857795744032899847e+03 1.028801214641978268e+00
1.866379543146648075e+03 1.028913165922607176e+00
1.875003003029058164e+03 1.029023203357251726e+00
1.883666306929590519e+03 1.029131336114996520e+00
1.892369638944398730e+03 1.029237573177956611e+00
1.901113184020238577e+03 1.029341923342675269e+00
1.909897127958393639e+03 1.029444395221799535e+00
1.918721657418629547e+03 1.029544997247173743e+00
1.927586959923157337e+03 1.029643737674630133e+00
1.936493223860624994e+03 1.029740624594563947e+00
1.945440638490107631e+03 1.029835665954597745e+00
1.954429393945145193e+03 1.029928869623009557e+00
1.963459681237768336e+03 1.030020243605912045e+00
1.972531692262564320e+03 1.030109797176315345e+00
1.981645619800759732e+03 1.030197557769213290e+00
1.990801657524303891e+03 1.030283410206175532e+00
2.000000000000000000e+03 1.030367550136084720e+00
