# Frequency    Median mag            Median phase (Rad)    16th percentile mag   16th percentile phase 84th percentile mag   84th percentile phase
+1.0000000e+01 +1.0094546e+00 -1.2536223e-02 +9.2974405e-01 -3.8514817e-02 +1.0886029e+00 +1.4036705e-02
+1.0647838e+01 +1.0081579e+00 -1.2849380e-02 +9.2793753e-01 -3.3167371e-02 +1.0842537e+00 +8.8437566e-03
+1.1337646e+01 +1.0066922e+00 -1.1719021e-02 +9.3048368e-01 -3.2072501e-02 +1.0772298e+00 +7.4294722e-03
+1.2072142e+01 +1.0034224e+00 -1.1690318e-02 +9.3340181e-01 -3.3778653e-02 +1.0684012e+00 +1.0148747e-02
+1.2854222e+01 +1.0001262e+00 -1.1552203e-02 +9.3656067e-01 -3.7985512e-02 +1.0591212e+00 +1.4963445e-02
+1.3686967e+01 +9.9920677e-01 -1.1160648e-02 +9.4164507e-01 -4.0155797e-02 +1.0504379e+00 +1.9183010e-02
+1.4573661e+01 +9.9686441e-01 -1.0125929e-02 +9.4697882e-01 -4.1270516e-02 +1.0446614e+00 +2.2174005e-02
+1.5517799e+01 +9.9549287e-01 -9.1951035e-03 +9.5218786e-01 -4.1901777e-02 +1.0367176e+00 +2.7335948e-02
+1.6523101e+01 +9.9433197e-01 -8.0573597e-03 +9.5651950e-01 -4.1969600e-02 +1.0308279e+00 +3.0779551e-02
+1.7593531e+01 +9.9336319e-01 -5.8811784e-03 +9.5984429e-01 -4.1232919e-02 +1.0261354e+00 +3.2243703e-02
+1.8733307e+01 +9.9213649e-01 -4.3130035e-03 +9.6078088e-01 -4.0073327e-02 +1.0232289e+00 +3.4315683e-02
+1.9946923e+01 +9.9218420e-01 -2.5054354e-03 +9.6281760e-01 -3.8740950e-02 +1.0206514e+00 +3.5205416e-02
+2.1239161e+01 +9.9266079e-01 -1.2792668e-03 +9.6456930e-01 -3.7299416e-02 +1.0197667e+00 +3.5709564e-02
+2.2615115e+01 +9.9297272e-01 +1.3030494e-04 +9.6476024e-01 -3.5953605e-02 +1.0186400e+00 +3.6931585e-02
+2.4080208e+01 +9.9287805e-01 +1.3246469e-03 +9.6529313e-01 -3.4400532e-02 +1.0185825e+00 +3.7733408e-02
+2.5640216e+01 +9.9261016e-01 +2.1887572e-03 +9.6516948e-01 -3.2481872e-02 +1.0199089e+00 +3.8647857e-02
+2.7301288e+01 +9.9348278e-01 +3.6005761e-03 +9.6506235e-01 -3.0753212e-02 +1.0206550e+00 +3.8560846e-02
+2.9069970e+01 +9.9407683e-01 +4.8350310e-03 +9.6545751e-01 -2.9315396e-02 +1.0225630e+00 +3.9195442e-02
+3.0953234e+01 +9.9412817e-01 +5.0906824e-03 +9.6423089e-01 -2.7638768e-02 +1.0248522e+00 +3.9755229e-02
+3.2958502e+01 +9.9535667e-01 +5.5680516e-03 +9.6348242e-01 -2.6445821e-02 +1.0283777e+00 +4.0233150e-02
+3.5093680e+01 +9.9576384e-01 +5.7425998e-03 +9.6388537e-01 -2.4297022e-02 +1.0299153e+00 +3.9607035e-02
+3.7367183e+01 +9.9710078e-01 +5.8712778e-03 +9.6269211e-01 -2.3234175e-02 +1.0323078e+00 +3.7814435e-02
+3.9787972e+01 +9.9756738e-01 +6.3150721e-03 +9.6047209e-01 -2.2438427e-02 +1.0356119e+00 +3.5955471e-02
+4.2365590e+01 +9.9862587e-01 +6.5159213e-03 +9.5860378e-01 -2.0741393e-02 +1.0394326e+00 +3.4288702e-02
+4.5110195e+01 +9.9940374e-01 +6.5036492e-03 +9.5770765e-01 -1.9071911e-02 +1.0412635e+00 +3.2667832e-02
+4.8032606e+01 +9.9981094e-01 +6.3058987e-03 +9.5689590e-01 -1.7319708e-02 +1.0436629e+00 +3.1781805e-02
+5.1144342e+01 +1.0013370e+00 +6.3697612e-03 +9.5609624e-01 -1.7320095e-02 +1.0459076e+00 +2.9939211e-02
+5.4457668e+01 +1.0024854e+00 +5.8129732e-03 +9.5538395e-01 -1.6209738e-02 +1.0475028e+00 +2.8254828e-02
+5.7985644e+01 +1.0034422e+00 +5.4437997e-03 +9.5546283e-01 -1.7603995e-02 +1.0497846e+00 +2.8753743e-02
+6.1742176e+01 +1.0041318e+00 +4.8989514e-03 +9.5470639e-01 -1.8970799e-02 +1.0506418e+00 +3.0721158e-02
+6.5742070e+01 +1.0039350e+00 +4.3674831e-03 +9.5524423e-01 -2.2209747e-02 +1.0513398e+00 +3.2440935e-02
+7.0001093e+01 +1.0045288e+00 +5.1510717e-03 +9.5644186e-01 -2.5796629e-02 +1.0506828e+00 +3.5507597e-02
+7.4536032e+01 +1.0049844e+00 +4.3485224e-03 +9.5854584e-01 -3.1090630e-02 +1.0472265e+00 +3.8218925e-02
+7.9364761e+01 +1.0053557e+00 +3.3237738e-03 +9.6260617e-01 -3.6367071e-02 +1.0439874e+00 +4.2712624e-02
+8.4506314e+01 +1.0049074e+00 +3.1247855e-03 +9.6720508e-01 -4.1458226e-02 +1.0394737e+00 +4.6389279e-02
+8.9980956e+01 +1.0049682e+00 +2.5378183e-03 +9.7299447e-01 -4.4675361e-02 +1.0361102e+00 +5.0062475e-02
+9.5810267e+01 +1.0051054e+00 +2.1444255e-03 +9.7877084e-01 -4.8777110e-02 +1.0305061e+00 +5.3354358e-02
+1.0201722e+02 +1.0045306e+00 +1.5647723e-03 +9.8382652e-01 -5.1760035e-02 +1.0254136e+00 +5.5807180e-02
+1.0862629e+02 +1.0042870e+00 +1.1674505e-03 +9.8886317e-01 -5.2927352e-02 +1.0208749e+00 +5.6907570e-02
+1.1566352e+02 +1.0041903e+00 +3.4097084e-04 +9.9148268e-01 -5.3952171e-02 +1.0184008e+00 +5.5162404e-02
+1.2315664e+02 +1.0047070e+00 -5.7308025e-04 +9.8989003e-01 -5.3224702e-02 +1.0194010e+00 +5.3753566e-02
+1.3113520e+02 +1.0042715e+00 -6.2673580e-04 +9.8685557e-01 -5.2158548e-02 +1.0227146e+00 +5.1560021e-02
+1.3963064e+02 +1.0035505e+00 -6.4574095e-04 +9.8163232e-01 -4.8742180e-02 +1.0271969e+00 +4.7400917e-02
+1.4867645e+02 +1.0038267e+00 -9.9068485e-04 +9.7726008e-01 -4.6158729e-02 +1.0317009e+00 +4.2749788e-02
+1.5830827e+02 +1.0036904e+00 -2.1716728e-03 +9.7350505e-01 -4.2851760e-02 +1.0346532e+00 +3.7453121e-02
+1.6856409e+02 +1.0030990e+00 -2.6312632e-03 +9.7054717e-01 -3.9201057e-02 +1.0368487e+00 +3.1663727e-02
+1.7948432e+02 +1.0026041e+00 -3.2116694e-03 +9.6848518e-01 -3.4259577e-02 +1.0374198e+00 +2.4814394e-02
+1.9111200e+02 +1.0018593e+00 -3.4603873e-03 +9.6845239e-01 -2.9496208e-02 +1.0362981e+00 +1.9981787e-02
+2.0349296e+02 +1.0012497e+00 -3.4934000e-03 +9.6815031e-01 -2.4982854e-02 +1.0348611e+00 +1.5219470e-02
+2.1667602e+02 +1.0008088e+00 -3.3200627e-03 +9.6825842e-01 -2.1147759e-02 +1.0321772e+00 +1.1687367e-02
+2.3071312e+02 +1.0002541e+00 -3.4250719e-03 +9.7014331e-01 -1.7889826e-02 +1.0285078e+00 +9.8770428e-03
+2.4565960e+02 +1.0001198e+00 -3.1273883e-03 +9.7322661e-01 -1.5431422e-02 +1.0251902e+00 +8.6596336e-03
+2.6157437e+02 +1.0003752e+00 -3.0692613e-03 +9.7629917e-01 -1.4362807e-02 +1.0227731e+00 +8.1303954e-03
+2.7852016e+02 +1.0005737e+00 -2.6496678e-03 +9.7899566e-01 -1.3904853e-02 +1.0199487e+00 +7.6092829e-03
+2.9656376e+02 +1.0006602e+00 -2.5007249e-03 +9.8116817e-01 -1.3635288e-02 +1.0184091e+00 +7.6541187e-03
+3.1577629e+02 +1.0009228e+00 -2.7315598e-03 +9.8303800e-01 -1.3426419e-02 +1.0166836e+00 +7.4103848e-03
+3.3623349e+02 +1.0008801e+00 -2.7180152e-03 +9.8504578e-01 -1.3869133e-02 +1.0150511e+00 +7.3727126e-03
+3.5801598e+02 +1.0010838e+00 -2.7888939e-03 +9.8651522e-01 -1.4154965e-02 +1.0138013e+00 +7.4297722e-03
+3.8120963e+02 +1.0009495e+00 -3.0231790e-03 +9.8767944e-01 -1.4849845e-02 +1.0135399e+00 +7.3783201e-03
+4.0590584e+02 +1.0009528e+00 -3.2883998e-03 +9.8810112e-01 -1.5368936e-02 +1.0130594e+00 +7.3167531e-03
+4.3220198e+02 +1.0020554e+00 -3.4283826e-03 +9.8947306e-01 -1.6656880e-02 +1.0144050e+00 +9.2904672e-03
+4.6020168e+02 +1.0019789e+00 -3.3210978e-03 +9.9038859e-01 -1.6761707e-02 +1.0141136e+00 +9.7359809e-03
+4.9001530e+02 +1.0019902e+00 -4.9371949e-03 +9.8780518e-01 -1.7992581e-02 +1.0148587e+00 +7.3935702e-03
+5.2176037e+02 +1.0021786e+00 -5.1301483e-03 +9.8787467e-01 -1.8582053e-02 +1.0149551e+00 +7.3926898e-03
+5.5556200e+02 +1.0015097e+00 -6.2284336e-03 +9.8626615e-01 -1.9435936e-02 +1.0155235e+00 +5.6362296e-03
+5.9155343e+02 +1.0014602e+00 -5.7262192e-03 +9.8819250e-01 -1.8753061e-02 +1.0146550e+00 +6.0134991e-03
+6.2987653e+02 +1.0021535e+00 -6.0211388e-03 +9.8861250e-01 -2.0015746e-02 +1.0153851e+00 +6.5101669e-03
+6.7068234e+02 +1.0021692e+00 -6.5397504e-03 +9.8822840e-01 -2.1556573e-02 +1.0168431e+00 +7.0479588e-03
+7.1413171e+02 +1.0026562e+00 -7.1296858e-03 +9.8747196e-01 -2.3088256e-02 +1.0177910e+00 +7.3365400e-03
+7.6039589e+02 +1.0028668e+00 -7.4945939e-03 +9.8633018e-01 -2.5038013e-02 +1.0185616e+00 +7.6332108e-03
+8.0965725e+02 +1.0029208e+00 -8.2508031e-03 +9.8515711e-01 -2.6950722e-02 +1.0206454e+00 +7.9189669e-03
+8.6210994e+02 +1.0031533e+00 -9.0046414e-03 +9.8422351e-01 -2.8552285e-02 +1.0219367e+00 +8.3824029e-03
+9.1796072e+02 +1.0036453e+00 -9.8330615e-03 +9.8303833e-01 -3.0398595e-02 +1.0231395e+00 +9.2445550e-03
+9.7742973e+02 +1.0034116e+00 -1.0201197e-02 +9.8192639e-01 -3.2188097e-02 +1.0249528e+00 +9.8544971e-03
+1.0407514e+03 +1.0034824e+00 -1.0539897e-02 +9.8035300e-01 -3.4474164e-02 +1.0271959e+00 +1.1178222e-02
+1.1081752e+03 +1.0040079e+00 -1.1265615e-02 +9.7924807e-01 -3.7041974e-02 +1.0295770e+00 +1.2932007e-02
+1.1799671e+03 +1.0042352e+00 -1.1694600e-02 +9.7766357e-01 -4.0137095e-02 +1.0318320e+00 +1.4051664e-02
+1.2564098e+03 +1.0045088e+00 -1.2709413e-02 +9.7577820e-01 -4.3064488e-02 +1.0343108e+00 +1.5799128e-02
+1.3378049e+03 +1.0043120e+00 -1.3892675e-02 +9.7403277e-01 -4.5365151e-02 +1.0370018e+00 +1.7100341e-02
+1.4244730e+03 +1.0046165e+00 -1.4637600e-02 +9.7240640e-01 -4.8614081e-02 +1.0395255e+00 +1.8175943e-02
+1.5167558e+03 +1.0048893e+00 -1.5382020e-02 +9.7016005e-01 -5.1652341e-02 +1.0422162e+00 +1.9471725e-02
+1.6150171e+03 +1.0052106e+00 -1.6039882e-02 +9.6765455e-01 -5.5183073e-02 +1.0452515e+00 +2.0442459e-02
+1.7196440e+03 +1.0057703e+00 -1.6852960e-02 +9.6529998e-01 -5.9694453e-02 +1.0480316e+00 +2.2138149e-02
+1.8310492e+03 +1.0063689e+00 -1.8180939e-02 +9.6345784e-01 -6.3287718e-02 +1.0505732e+00 +2.4151125e-02
+1.9496715e+03 +1.0066088e+00 -1.9229357e-02 +9.6105256e-01 -6.7022448e-02 +1.0535268e+00 +2.5290573e-02
+2.0759787e+03 +1.0067490e+00 -2.0440261e-02 +9.5852551e-01 -7.1251170e-02 +1.0564831e+00 +2.6531341e-02
+2.2104686e+03 +1.0067425e+00 -2.1835630e-02 +9.5647188e-01 -7.5453056e-02 +1.0602177e+00 +2.8100403e-02
+2.3536712e+03 +1.0065666e+00 -2.3375547e-02 +9.5290950e-01 -7.9991971e-02 +1.0642003e+00 +2.9483055e-02
+2.5061510e+03 +1.0066758e+00 -2.5135140e-02 +9.4970908e-01 -8.4436069e-02 +1.0679502e+00 +3.1052675e-02
+2.6685090e+03 +1.0071866e+00 -2.5751445e-02 +9.4712880e-01 -8.9414507e-02 +1.0718160e+00 +3.3078888e-02
+2.8413853e+03 +1.0076155e+00 -2.7538038e-02 +9.4477248e-01 -9.4075495e-02 +1.0759545e+00 +3.5191710e-02
+3.0254611e+03 +1.0081166e+00 -2.8924690e-02 +9.4207282e-01 -9.9163397e-02 +1.0806039e+00 +3.6763308e-02
+3.2214620e+03 +1.0087835e+00 -3.1022467e-02 +9.3914144e-01 -1.0503166e-01 +1.0844202e+00 +3.8434309e-02
+3.4301607e+03 +1.0097994e+00 -3.3041541e-02 +9.3633840e-01 -1.1016623e-01 +1.0887180e+00 +3.9997628e-02
+3.6523796e+03 +1.0102290e+00 -3.5032642e-02 +9.3403515e-01 -1.1636805e-01 +1.0940891e+00 +4.1562538e-02
+3.8889947e+03 +1.0108283e+00 -3.6886517e-02 +9.3199309e-01 -1.2136111e-01 +1.0986736e+00 +4.2632303e-02
+4.1409387e+03 +1.0113218e+00 -3.9738421e-02 +9.2985836e-01 -1.2818878e-01 +1.1042257e+00 +4.4058639e-02
+4.4092045e+03 +1.0117998e+00 -4.2294554e-02 +9.2650341e-01 -1.3552642e-01 +1.1099732e+00 +4.5938512e-02
+4.6948497e+03 +1.0111401e+00 -4.5328423e-02 +9.2402569e-01 -1.4247580e-01 +1.1159787e+00 +4.7434830e-02
+4.9990000e+03 +1.0115149e+00 -4.8633285e-02 +9.2007455e-01 -1.4945406e-01 +1.1221881e+00 +4.8930337e-02
