# Frequency    Median mag            Median phase (Rad)    16th percentile mag   16th percentile phase 84th percentile mag   84th percentile phase
+1.0000000e+01 +1.0143034e+00 -1.2514919e-02 +9.5794356e-01 -3.1505351e-02 +1.0674333e+00 +6.6254964e-03
+1.0647838e+01 +1.0111690e+00 -1.4216662e-02 +9.5738516e-01 -2.7311350e-02 +1.0636445e+00 +1.1940485e-03
+1.1337646e+01 +1.0080172e+00 -1.4563654e-02 +9.5712200e-01 -2.6807468e-02 +1.0584183e+00 -1.7910453e-03
+1.2072142e+01 +1.0048752e+00 -1.4791615e-02 +9.5772979e-01 -2.7785886e-02 +1.0505276e+00 -7.4314957e-04
+1.2854222e+01 +1.0018745e+00 -1.4184380e-02 +9.5841591e-01 -3.0024146e-02 +1.0432500e+00 +2.6312127e-03
+1.3686967e+01 +9.9718202e-01 -1.3672553e-02 +9.5989695e-01 -3.1214158e-02 +1.0352910e+00 +5.9273776e-03
+1.4573661e+01 +9.9526796e-01 -1.1793898e-02 +9.6266285e-01 -3.2133584e-02 +1.0297808e+00 +9.1025299e-03
+1.5517799e+01 +9.9351452e-01 -1.0585234e-02 +9.6420790e-01 -3.1225303e-02 +1.0230009e+00 +1.1975023e-02
+1.6523101e+01 +9.9235242e-01 -8.4965195e-03 +9.6603802e-01 -3.1165679e-02 +1.0179622e+00 +1.5108127e-02
+1.7593531e+01 +9.9084235e-01 -5.9244478e-03 +9.6802467e-01 -3.0273520e-02 +1.0138865e+00 +1.7656765e-02
+1.8733307e+01 +9.9019860e-01 -3.9480376e-03 +9.6981845e-01 -2.9545342e-02 +1.0099717e+00 +1.9818718e-02
+1.9946923e+01 +9.9018326e-01 -1.6648247e-03 +9.7191308e-01 -2.8315747e-02 +1.0076995e+00 +2.1815848e-02
+2.1239161e+01 +9.8999939e-01 +6.7390653e-04 +9.7387550e-01 -2.6599698e-02 +1.0058358e+00 +2.4811019e-02
+2.2615115e+01 +9.9021579e-01 +1.8673187e-03 +9.7564449e-01 -2.5695554e-02 +1.0052341e+00 +2.7273534e-02
+2.4080208e+01 +9.9086023e-01 +3.2831575e-03 +9.7616803e-01 -2.4435028e-02 +1.0054828e+00 +2.9269516e-02
+2.5640216e+01 +9.9150921e-01 +4.0396705e-03 +9.7625933e-01 -2.3166999e-02 +1.0062147e+00 +3.1234211e-02
+2.7301288e+01 +9.9161940e-01 +4.9409822e-03 +9.7644767e-01 -2.2954821e-02 +1.0080944e+00 +3.1983235e-02
+2.9069970e+01 +9.9273674e-01 +5.3808714e-03 +9.7623361e-01 -2.1469305e-02 +1.0101070e+00 +3.2409589e-02
+3.0953234e+01 +9.9430428e-01 +6.2051546e-03 +9.7616527e-01 -2.0445739e-02 +1.0128630e+00 +3.2358570e-02
+3.2958502e+01 +9.9538536e-01 +6.4264412e-03 +9.7553787e-01 -1.8895018e-02 +1.0164841e+00 +3.1824599e-02
+3.5093680e+01 +9.9632048e-01 +6.8457997e-03 +9.7540923e-01 -1.7890350e-02 +1.0194113e+00 +3.0839290e-02
+3.7367183e+01 +9.9774148e-01 +6.6909560e-03 +9.7424304e-01 -1.6760760e-02 +1.0226750e+00 +2.9610915e-02
+3.9787972e+01 +9.9793241e-01 +6.4526809e-03 +9.7326457e-01 -1.6713890e-02 +1.0263714e+00 +2.8232827e-02
+4.2365590e+01 +9.9858773e-01 +5.5091662e-03 +9.7201924e-01 -1.6096319e-02 +1.0293273e+00 +2.5747570e-02
+4.5110195e+01 +9.9989882e-01 +4.7264827e-03 +9.7123365e-01 -1.4760906e-02 +1.0313913e+00 +2.3476926e-02
+4.8032606e+01 +1.0011177e+00 +4.2647422e-03 +9.7061638e-01 -1.4103444e-02 +1.0343143e+00 +2.1159719e-02
+5.1144342e+01 +1.0015448e+00 +3.1044423e-03 +9.7042055e-01 -1.3585512e-02 +1.0362034e+00 +1.9007448e-02
+5.4457668e+01 +1.0022956e+00 +1.4520180e-03 +9.6985822e-01 -1.4316514e-02 +1.0377192e+00 +1.7521150e-02
+5.7985644e+01 +1.0020148e+00 +3.0250722e-04 +9.6877115e-01 -1.5276148e-02 +1.0383678e+00 +1.6869189e-02
+6.1742176e+01 +1.0023735e+00 -1.4251110e-03 +9.6850903e-01 -1.7346117e-02 +1.0384626e+00 +1.5989581e-02
+6.5742070e+01 +1.0016722e+00 -2.9299288e-03 +9.6875998e-01 -1.9922061e-02 +1.0374915e+00 +1.7524836e-02
+7.0001093e+01 +1.0016318e+00 -4.5365183e-03 +9.6974930e-01 -2.3311599e-02 +1.0351734e+00 +1.8752806e-02
+7.4536032e+01 +1.0010868e+00 -5.2173793e-03 +9.7097827e-01 -2.7573224e-02 +1.0328957e+00 +1.9930700e-02
+7.9364761e+01 +1.0005326e+00 -6.2779123e-03 +9.7295482e-01 -3.1383902e-02 +1.0295521e+00 +2.1689168e-02
+8.4506314e+01 +9.9944056e-01 -6.6559810e-03 +9.7462322e-01 -3.4473520e-02 +1.0254523e+00 +2.3867960e-02
+8.9980956e+01 +9.9841897e-01 -6.7347971e-03 +9.7751691e-01 -3.7219397e-02 +1.0208018e+00 +2.5630751e-02
+9.5810267e+01 +9.9732241e-01 -6.7315584e-03 +9.8060749e-01 -3.9231933e-02 +1.0161078e+00 +2.6958168e-02
+1.0201722e+02 +9.9642389e-01 -6.7785049e-03 +9.8330990e-01 -4.0231436e-02 +1.0120793e+00 +2.8236558e-02
+1.0862629e+02 +9.9582348e-01 -6.5762421e-03 +9.8495343e-01 -4.0407386e-02 +1.0081835e+00 +2.9037681e-02
+1.1566352e+02 +9.9566595e-01 -5.6962699e-03 +9.8587372e-01 -3.9862933e-02 +1.0056382e+00 +2.9464264e-02
+1.2315664e+02 +9.9517424e-01 -4.5687810e-03 +9.8482195e-01 -3.8192579e-02 +1.0057040e+00 +2.9174764e-02
+1.3113520e+02 +9.9421876e-01 -3.4547192e-03 +9.8246913e-01 -3.6120616e-02 +1.0075482e+00 +2.8748299e-02
+1.3963064e+02 +9.9454505e-01 -2.6682879e-03 +9.7990647e-01 -3.3585360e-02 +1.0102156e+00 +2.7025513e-02
+1.4867645e+02 +9.9535132e-01 -2.3030810e-03 +9.7664157e-01 -3.0714993e-02 +1.0128445e+00 +2.5034639e-02
+1.5830827e+02 +9.9580076e-01 -1.1932371e-03 +9.7486752e-01 -2.7009680e-02 +1.0150336e+00 +2.2949502e-02
+1.6856409e+02 +9.9615753e-01 -8.5711277e-04 +9.7320549e-01 -2.2938969e-02 +1.0168133e+00 +2.1141008e-02
+1.7948432e+02 +9.9644887e-01 -3.3725295e-04 +9.7311485e-01 -1.9586537e-02 +1.0180286e+00 +1.8659131e-02
+1.9111200e+02 +9.9690453e-01 -1.4179707e-04 +9.7306728e-01 -1.5900026e-02 +1.0190206e+00 +1.6021413e-02
+2.0349296e+02 +9.9740039e-01 +4.5838356e-04 +9.7456934e-01 -1.2996986e-02 +1.0192877e+00 +1.2753482e-02
+2.1667602e+02 +9.9742701e-01 +5.3171310e-04 +9.7651452e-01 -1.0121607e-02 +1.0186354e+00 +1.0929477e-02
+2.3071312e+02 +9.9763282e-01 +7.3864071e-04 +9.7878183e-01 -8.6005746e-03 +1.0182638e+00 +9.4820892e-03
+2.4565960e+02 +9.9786964e-01 +5.7958647e-04 +9.8131845e-01 -7.3392104e-03 +1.0171757e+00 +8.8056563e-03
+2.6157437e+02 +9.9835516e-01 +6.5120084e-04 +9.8355235e-01 -6.8405144e-03 +1.0159059e+00 +8.4438227e-03
+2.7852016e+02 +9.9876163e-01 +7.7377247e-04 +9.8523928e-01 -6.6679858e-03 +1.0143323e+00 +8.4116674e-03
+2.9656376e+02 +9.9922855e-01 +8.0251505e-04 +9.8674637e-01 -6.6963632e-03 +1.0133229e+00 +8.3724682e-03
+3.1577629e+02 +9.9946851e-01 +8.5491113e-04 +9.8803768e-01 -6.7727477e-03 +1.0126416e+00 +8.1889651e-03
+3.3623349e+02 +9.9968001e-01 +9.2814709e-04 +9.8903157e-01 -6.7952996e-03 +1.0116854e+00 +8.0160538e-03
+3.5801598e+02 +9.9994682e-01 +9.4882325e-04 +9.8958450e-01 -6.9020255e-03 +1.0110123e+00 +8.2537992e-03
+3.8120963e+02 +9.9992196e-01 +1.1157620e-03 +9.8990006e-01 -7.1346906e-03 +1.0100089e+00 +8.5492398e-03
+4.0590584e+02 +9.9997593e-01 +1.5394584e-03 +9.8979425e-01 -7.1463885e-03 +1.0092626e+00 +9.2236253e-03
+4.3220198e+02 +1.0003429e+00 +2.1970118e-03 +9.8964998e-01 -7.1516114e-03 +1.0096670e+00 +1.1335002e-02
+4.6020168e+02 +1.0002643e+00 +2.9366763e-03 +9.8999136e-01 -7.1175423e-03 +1.0096563e+00 +1.1759376e-02
+4.9001530e+02 +1.0011588e+00 +2.7707063e-03 +9.8983757e-01 -6.8525978e-03 +1.0115364e+00 +1.1817385e-02
+5.2176037e+02 +1.0013502e+00 +3.1243158e-03 +9.8950793e-01 -6.7611986e-03 +1.0117356e+00 +1.2279888e-02
+5.5556200e+02 +1.0016185e+00 +3.0655045e-03 +9.8905043e-01 -6.3105502e-03 +1.0131434e+00 +1.2405210e-02
+5.9155343e+02 +1.0010292e+00 +3.2947391e-03 +9.8970619e-01 -6.4206908e-03 +1.0119432e+00 +1.2653200e-02
+6.2987653e+02 +1.0007881e+00 +3.7090410e-03 +9.8957676e-01 -6.7261629e-03 +1.0120243e+00 +1.3750003e-02
+6.7068234e+02 +1.0008954e+00 +3.9521142e-03 +9.8909137e-01 -7.1760460e-03 +1.0126066e+00 +1.4742126e-02
+7.1413171e+02 +1.0010820e+00 +4.4476331e-03 +9.8886213e-01 -7.6724885e-03 +1.0134940e+00 +1.5860469e-02
+7.6039589e+02 +1.0013950e+00 +4.9387657e-03 +9.8815741e-01 -8.0391975e-03 +1.0146059e+00 +1.6855887e-02
+8.0965725e+02 +1.0015258e+00 +5.1462757e-03 +9.8740983e-01 -8.4386305e-03 +1.0160168e+00 +1.7906072e-02
+8.6210994e+02 +1.0019470e+00 +5.2172993e-03 +9.8663876e-01 -9.2343956e-03 +1.0170463e+00 +1.9027736e-02
+9.1796072e+02 +1.0019480e+00 +5.8319882e-03 +9.8558060e-01 -9.9820451e-03 +1.0180973e+00 +2.0420175e-02
+9.7742973e+02 +1.0017252e+00 +6.1141625e-03 +9.8470113e-01 -1.0413642e-02 +1.0191197e+00 +2.2385792e-02
+1.0407514e+03 +1.0016035e+00 +6.6438155e-03 +9.8352144e-01 -1.1243334e-02 +1.0204909e+00 +2.4105162e-02
+1.1081752e+03 +1.0016894e+00 +7.1163352e-03 +9.8211552e-01 -1.2394662e-02 +1.0219248e+00 +2.5784183e-02
+1.1799671e+03 +1.0013385e+00 +7.3706649e-03 +9.8088872e-01 -1.3516843e-02 +1.0235305e+00 +2.7889707e-02
+1.2564098e+03 +1.0014547e+00 +7.4139580e-03 +9.7970768e-01 -1.4866019e-02 +1.0253151e+00 +2.9419186e-02
+1.3378049e+03 +1.0010854e+00 +7.8744526e-03 +9.7839099e-01 -1.6400641e-02 +1.0273593e+00 +3.1790357e-02
+1.4244730e+03 +1.0008869e+00 +8.6120378e-03 +9.7738149e-01 -1.7663349e-02 +1.0292618e+00 +3.3989076e-02
+1.5167558e+03 +1.0010129e+00 +8.5703587e-03 +9.7552398e-01 -1.9398062e-02 +1.0315736e+00 +3.6401625e-02
+1.6150171e+03 +1.0012503e+00 +9.0485316e-03 +9.7363669e-01 -2.1260203e-02 +1.0329062e+00 +3.8960372e-02
+1.7196440e+03 +1.0012510e+00 +9.1035525e-03 +9.7167113e-01 -2.3517966e-02 +1.0350087e+00 +4.2017663e-02
+1.8310492e+03 +1.0014671e+00 +9.5998102e-03 +9.6952215e-01 -2.5208277e-02 +1.0372203e+00 +4.4243283e-02
+1.9496715e+03 +1.0018031e+00 +9.8549337e-03 +9.6689512e-01 -2.6949755e-02 +1.0396973e+00 +4.7613729e-02
+2.0759787e+03 +1.0019035e+00 +1.0669492e-02 +9.6463369e-01 -2.9554313e-02 +1.0419205e+00 +5.0093331e-02
+2.2104686e+03 +1.0013851e+00 +1.0379001e-02 +9.6268322e-01 -3.0792725e-02 +1.0444371e+00 +5.3797896e-02
+2.3536712e+03 +1.0006056e+00 +1.1362332e-02 +9.6042579e-01 -3.2955073e-02 +1.0476329e+00 +5.6583627e-02
+2.5061510e+03 +1.0004278e+00 +1.2143481e-02 +9.5784795e-01 -3.4728749e-02 +1.0508524e+00 +5.9570171e-02
+2.6685090e+03 +1.0004743e+00 +1.2744332e-02 +9.5542494e-01 -3.6942115e-02 +1.0536981e+00 +6.2366894e-02
+2.8413853e+03 +1.0007848e+00 +1.2993106e-02 +9.5229775e-01 -3.9256038e-02 +1.0568381e+00 +6.5915419e-02
+3.0254611e+03 +1.0013968e+00 +1.3708409e-02 +9.5002800e-01 -4.1433496e-02 +1.0599205e+00 +6.9608692e-02
+3.2214620e+03 +1.0011259e+00 +1.4228883e-02 +9.4740407e-01 -4.4790479e-02 +1.0645268e+00 +7.3025234e-02
+3.4301607e+03 +1.0006889e+00 +1.5204351e-02 +9.4410160e-01 -4.8093325e-02 +1.0671390e+00 +7.5852443e-02
+3.6523796e+03 +1.0012804e+00 +1.5688690e-02 +9.4197272e-01 -5.1206156e-02 +1.0701511e+00 +7.9503081e-02
+3.8889947e+03 +1.0010520e+00 +1.6569485e-02 +9.3854794e-01 -5.4007838e-02 +1.0741635e+00 +8.3800249e-02
+4.1409387e+03 +1.0022193e+00 +1.7520865e-02 +9.3500566e-01 -5.8172949e-02 +1.0782897e+00 +8.7585175e-02
+4.4092045e+03 +1.0032799e+00 +1.8253368e-02 +9.3134339e-01 -6.0398502e-02 +1.0818740e+00 +9.2089679e-02
+4.6948497e+03 +1.0035424e+00 +1.9040993e-02 +9.2815165e-01 -6.3302393e-02 +1.0855200e+00 +9.6348998e-02
+4.9990000e+03 +1.0038950e+00 +2.0142919e-02 +9.2511252e-01 -6.5707918e-02 +1.0897511e+00 +1.0030573e-01
