2.000000000000000000e+01 2.508267023349661459e-24
2.046822804210906810e+01 2.400881900365207690e-24
2.094741795918899641e+01 2.298924687648490153e-24
2.143782638410255359e+01 2.202168081455707393e-24
2.193971595784767459e+01 2.110395213784400892e-24
2.245335547021627320e+01 2.023399096937101700e-24
2.297902000374618581e+01 1.940982085387515543e-24
2.351699108104314107e+01 1.862955353961272809e-24
2.406755681555178938e+01 1.789138391568437574e-24
2.463101206585651326e+01 1.719358509936151792e-24
2.520765859359455163e+01 1.653450366992513791e-24
2.579780522506617757e+01 1.591255504815849135e-24
2.640176801662836681e+01 1.532621902323272984e-24
2.701987042396053340e+01 1.477403543111894979e-24
2.765244347529311852e+01 1.425459999158772332e-24
2.829982594869152024e+01 1.376656031366748108e-24
2.896236455349067995e+01 1.330861208132596596e-24
2.964041411597717612e+01 1.287949543417346380e-24
3.033433776941845395e+01 1.247799155928572494e-24
3.104450714854094784e+01 1.210291951196686909e-24
3.177130258856105982e+01 1.175313328356788842e-24
3.251511332887589134e+01 1.142751913476685811e-24
3.327633772152258729e+01 1.112499321131626821e-24
3.405538344451799304e+01 1.084449945719865839e-24
3.485266772019300419e+01 1.058500783717698884e-24
3.566861753863819473e+01 1.034551287631678552e-24
3.650366988638086951e+01 1.012503251896528444e-24
3.735827198041565822e+01 9.922607304021026323e-25
3.823288150771404048e+01 9.737299846533519507e-25
3.912796687034128240e+01 9.568194609523215591e-25
4.004400743631169490e+01 9.414397943130643519e-25
4.098149379631694700e+01 9.275038362441634125e-25
4.194092802646466112e+01 9.149267030152528031e-25
4.292282395716807741e+01 9.036258406023424582e-25
4.392770744833092067e+01 8.935211022561550002e-25
4.495611667097450947e+01 8.845348344672560072e-25
4.600860239545836805e+01 8.765919671293473762e-25
4.708572828644836505e+01 8.696201038280759318e-25
4.818807120479049644e+01 8.635496084459988605e-25
4.931622151645208163e+01 8.583136846476942890e-25
5.047078340869532553e+01 8.538484452473591074e-25
5.165237521365352791e+01 8.500929689885212119e-25
5.286162973948211885e+01 8.469893427909303154e-25
5.409919460926269608e+01 8.444826881009328391e-25
5.536573260784133765e+01 8.425211705071936796e-25
5.666192203678649264e+01 8.410559923297299932e-25
5.798845707765754298e+01 8.400413683573470656e-25
5.934604816377739667e+01 8.394344853405241396e-25
6.073542236070915834e+01 8.391954462105764767e-25
6.215732375564028445e+01 8.392872002936847684e-25
6.361251385588239060e+01 8.396754610103664867e-25
6.510177199670117432e+01 8.403286127149028011e-25
6.662589575869347414e+01 8.412176084205986985e-25
6.818570139493623117e+01 8.423158601828840830e-25
6.978202426813548698e+01 8.435991239051454596e-25
7.141571929800926455e+01 8.450453802620147555e-25
7.308766141914513526e+01 8.466347133326937605e-25
7.479874604957596773e+01 8.483491884215981587e-25
7.654988957032622920e+01 8.501727303854274864e-25
7.834202981618521733e+01 8.520910036390788772e-25
8.017612657796929909e+01 8.540912948467019601e-25
8.205316211654385938e+01 8.561623991390046514e-25
8.397414168887820551e+01 8.582945105528573284e-25
8.594009408641680636e+01 8.604791172264896220e-25
8.795207218605443700e+01 8.627089017621805800e-25
9.001115351400996190e+01 8.649776470324262331e-25
9.211844082290213009e+01 8.672801476055455985e-25
9.427506268233449305e+01 8.696121268624956651e-25
9.648217408330738465e+01 8.719701598024653909e-25
9.874095705678008983e+01 8.743516014624404373e-25
1.010526213067136041e+02 8.767545208192961467e-25
1.034184048579351156e+02 8.791776400019362746e-25
1.058395747191688514e+02 8.816202786032719009e-25
1.083174275615894260e+02 8.840823028591080515e-25
1.108532904132621582e+02 8.865640794421645887e-25
1.134485213698395683e+02 8.890664336090154969e-25
1.161045103218979335e+02 8.915906114334008341e-25
1.188226796993006928e+02 8.941382458584154864e-25
1.216044852329885657e+02 8.967113263026890115e-25
1.244514167346046492e+02 8.993121715629091489e-25
1.273649988943717375e+02 9.019434057637077226e-25
1.303467920976484322e+02 9.046079371140157946e-25
1.333983932606024609e+02 9.073089392430178474e-25
1.365214366854478669e+02 9.100498348983808813e-25
1.397175949357049944e+02 9.128342818027223650e-25
1.429885797319515461e+02 9.156661604779674011e-25
1.463361428685438739e+02 9.185495638564343459e-25
1.497620771518004688e+02 9.214887885119446830e-25
1.532682173601492650e+02 9.244883273561557486e-25
1.568564412267536454e+02 9.275528636534873466e-25
1.605286704451434900e+02 9.306872662215939264e-25
1.642868716983884667e+02 9.338965856923863147e-25
1.681330577123665364e+02 9.371860517183705754e-25
1.720692883336901957e+02 9.405610710171479543e-25
1.760976716328693215e+02 9.440272261557430495e-25
1.802203650333003964e+02 9.475902749831026894e-25
1.844395764666864750e+02 9.512561506258121741e-25
1.887575655555076537e+02 9.550309619686707945e-25
1.931766448231742004e+02 9.589209945476338912e-25
1.976991809325117515e+02 9.629327117874330005e-25
2.023275959532414277e+02 9.670727565212733182e-25
2.070643686591323558e+02 9.713479527354085590e-25
2.119120358555232144e+02 9.757653074838195833e-25
2.168731937379222074e+02 9.803320129243333457e-25
2.219504992824144551e+02 9.850554484294727938e-25
2.271466716686210532e+02 9.899431827304593823e-25
2.324644937359703931e+02 9.950029760548304480e-25
2.379068134740639380e+02 1.000242782222536104e-24
2.434765455479324316e+02 1.005670750668329884e-24
2.491766728590016555e+02 1.011295228360962367e-24
2.550102481426025918e+02 1.017124761594155741e-24
2.609803956028803782e+02 1.023168097626222811e-24
2.670903125859798024e+02 1.029434186149015983e-24
2.733432712924014822e+02 1.035932180570950331e-24
2.797426205294477768e+02 1.042671439100299145e-24
2.862917875046957761e+02 1.049661525620564195e-24
2.929942796614570284e+02 1.056912210351357563e-24
2.998536865572091301e+02 1.064433470292903087e-24
3.068736817860026918e+02 1.072235489454750267e-24
3.140580249458755588e+02 1.080328658874076353e-24
3.214105636523277099e+02 1.088723576431038399e-24
3.289352355989325929e+02 1.097431046473220091e-24
3.366360706661913582e+02 1.106462079264176667e-24
3.445171930797575328e+02 1.115827890274111875e-24
3.525828236191896394e+02 1.125539899334726185e-24
3.608372818784143874e+02 1.135609729682440062e-24
3.692849885791085853e+02 1.146049206917642676e-24
3.779304679382419749e+02 1.156870357909711380e-24
3.867783500910464909e+02 1.168085409680679259e-24
3.958333735707115011e+02 1.179706788301624277e-24
4.051003878461333443e+02 1.191747117838391354e-24
4.145843559190740280e+02 1.204219219384732465e-24
4.242903569821260135e+02 1.217136110222821841e-24
4.342235891389011044e+02 1.230511003153999648e-24
4.443893721879048258e+02 1.244357306049426962e-24
4.547931504715855908e+02 1.258688621692729692e-24
4.654404957920815491e+02 1.273518748081476513e-24
4.763371103952317185e+02 1.288861679929761126e-24
4.874888300244444395e+02 1.304731619279812401e-24
4.989016270460633677e+02 1.321142707170136581e-24
5.105816136479033958e+02 1.338110088622282079e-24
5.225350451126653297e+02 1.355648094443597951e-24
5.347683231679893652e+02 1.373771822697241791e-24
5.472879994149344611e+02 1.392496471743148054e-24
5.601007788367262492e+02 1.411837444841545853e-24
5.732135233896501632e+02 1.431810357594811479e-24
5.866332556780085952e+02 1.452431043056957364e-24
6.003671627151178427e+02 1.473715556978689712e-24
6.144225997723518731e+02 1.495680183519584446e-24
6.288070943183000736e+02 1.518341441502268893e-24
6.435283500501471963e+02 1.541716091230863552e-24
6.585942510194304305e+02 1.565821141879521524e-24
6.740128658543857227e+02 1.590673859450379799e-24
6.897924520811520779e+02 1.616291775296051628e-24
7.059414605461300880e+02 1.642692695198978481e-24
7.224685399418862062e+02 1.669894708997863138e-24
7.393825414390057631e+02 1.697916200749310318e-24
7.566925234263859465e+02 1.726775859411542188e-24
7.744077563625115772e+02 1.756492690035934586e-24
7.925377277402957361e+02 1.787086025450891986e-24
8.110921471681656385e+02 1.818575538422530872e-24
8.300809515700954080e+02 1.850981254275784431e-24
8.495143105073798324e+02 1.884323563959971929e-24
8.694026316250053696e+02 1.918623237542829544e-24
8.897565662255171901e+02 1.953901438117802031e-24
9.105870149733896142e+02 1.990179736110960586e-24
9.319051337329365197e+02 2.027480123978670099e-24
9.537223395428940194e+02 2.065825031313432489e-24
9.760503167308868342e+02 2.105237340710018847e-24
9.989010231710281005e+02 2.145740393594398053e-24
1.022286696688033203e+03 2.187358043626863533e-24
1.046219861611252782e+03 2.230114611450456931e-24
1.070713335482145112e+03 2.274034953225056685e-24
1.095780235918789231e+03 2.319144456558587634e-24
1.121433987641091790e+03 2.365469060844473962e-24
1.147688329660478757e+03 2.413035275065177052e-24
1.174557322637896732e+03 2.461870195800653962e-24
1.202055356414076414e+03 2.512001525528727883e-24
1.230197157716100946e+03 2.563457591230986841e-24
1.258997798044377760e+03 2.616267363310053597e-24
1.288472701744274218e+03 2.670460474823694239e-24
1.318637654266709887e+03 2.726067241042005902e-24
1.349508810622138753e+03 2.783118679335336054e-24
1.381102704032466363e+03 2.841646529402003780e-24
1.413436254785498477e+03 2.901683273847316083e-24
1.446526779296706991e+03 2.963262159137384305e-24
1.480391999383129132e+03 3.026417217328679774e-24
1.515050051754382594e+03 3.091183284782878421e-24
1.550519497725893189e+03 3.157596031547604461e-24
1.586819333159498683e+03 3.225691975212584374e-24
1.623968998636801871e+03 3.295508509077877348e-24
1.661988389870679384e+03 3.367083924163864561e-24
1.700897868360535767e+03 3.440457433138396651e-24
1.740718272297033309e+03 3.515669194677736441e-24
1.781470927722088163e+03 3.592760338331585964e-24
1.823177659950163843e+03 3.671772989918657068e-24
1.865860805256937510e+03 3.752750297475902431e-24
1.909543222841613442e+03 3.835736457786702530e-24
1.954248307069300608e+03 3.920776743526813083e-24
2.000000000000000000e+03 4.007917530697673848e-24
