2.000000000000000000e+01 -2.972049246293241520e+00
2.109952716083550328e+01 2.007495500299247393e+00
2.225950232054175615e+01 1.790878973495568127e+00
2.348324868994759740e+01 1.922793413799786189e+00
2.477427217791020198e+01 1.348540700465805431e+00
2.613627143538737840e+01 2.448354919383978867e+00
2.757314845169625528e+01 -1.184952069058426288e-01
2.908901973331572677e+01 2.616313330822282346e+00
3.068822809725876866e+01 5.989978897019808679e-01
3.237535511280132994e+01 1.477559989064524348e+00
3.415523422721231128e+01 1.701266612468419481e+00
3.603296461308822529e+01 5.813044345495529397e-01
3.801392577696397979e+01 1.323040115857579690e-01
4.010379297105183127e+01 1.373590966902744182e+00
4.230855345226157738e+01 8.543503581351885590e-02
4.463452363508271503e+01 1.384931880522611181e+00
4.708836718746909611e+01 4.668705091327266521e-01
4.967711412156997142e+01 2.295364325863166743e-02
5.240818093399955302e+01 3.303680567792190992e-01
5.528939185334521511e+01 1.330557494835963861e-01
5.832900125578675699e+01 6.146849889404867318e-01
6.153571731304403869e+01 -5.977384942630994402e-01
6.491872694040340264e+01 6.800169550751671288e-01
6.848772211629528783e+01 8.998730802029214493e-01
7.225292764882630081e+01 -2.269843664856677767e-01
7.622513046881468313e+01 1.779882741111226685e-01
8.041571053324926766e+01 2.994744936038408190e-01
8.483667342770891651e+01 1.563709780638382063e-01
8.950068476114380189e+01 -3.644004485017465211e-01
9.442110645155648285e+01 6.939657212561566313e-01
9.961203500653786591e+01 -2.268279125661459172e+00
1.050883419083271804e+02 -2.692401514155359221e-01
1.108657162190958019e+02 -1.758833835994217498e+00
1.169607095285145846e+02 5.476197448037192217e-01
1.233907833723743153e+02 -1.567979929123741512e+00
1.301743592581091491e+02 -1.140218671219154434e+00
1.373308714405416993e+02 -1.664084403522944511e+00
1.448808225990458141e+02 -3.485606413773244538e-01
1.528458425756377892e+02 9.818291279493713830e-01
1.612487503422729276e+02 -7.453453715219592324e-01
1.701136193748786241e+02 -1.095283906497311888e+00
1.794658466214141015e+02 9.986483654266143928e-01
1.893322252615433570e+02 2.182773387062037218e-01
1.997410214663678971e+02 5.380053353025163743e-01
2.107220553781329215e+02 -1.233772609588052321e-01
2.223067865419000384e+02 -2.408964120173239243e-01
2.345284040339441276e+02 1.838559399302980985e-02
2.474219215450802096e+02 6.239858800741275857e-01
2.610242776913264038e+02 9.434625205253331925e-01
2.753744418392806210e+02 2.355842110577219262e-01
2.905135257493910217e+02 -2.216230525702735654e-01
3.064849013569681802e+02 -1.277893833585910521e-01
3.233343250283667771e+02 1.877857822576457947e+00
3.411100686483218283e+02 7.964474348664826175e-01
3.598630579139866086e+02 7.027777361853195792e-01
3.796470182318741990e+02 8.925360233407574340e-01
4.005186286356818073e+02 1.470783840689803057e+00
4.225376841659580691e+02 -4.713916912835396933e-01
4.457672671768079908e+02 1.431617790379275057e+00
4.702739280604240548e+02 9.009852736884783608e-01
4.961278759071861941e+02 4.085708944108141227e-01
5.234031796475647980e+02 7.402398312484326226e-01
5.521779802520730982e+02 -1.815391782305210769e-02
5.825347145971950340e+02 -1.343435152336514893e+00
6.145603516386539695e+02 2.535869376881602077e-01
6.483466415686201572e+02 1.739062404663143380e-01
6.839903786706787514e+02 2.318496333722659397e-01
7.215936786256077085e+02 -3.233572179757505105e-01
7.612642710624102165e+02 -1.102357176198014849e-01
8.031158081927486592e+02 -3.290812096720775459e-01
8.472681904129632358e+02 -5.204379956761121528e-01
8.938479098065128028e+02 -2.084222908494603732e-01
9.429884125309283718e+02 -3.601631310060377511e-01
9.948304811274733765e+02 1.598839503418020280e-01
1.049522637848809154e+03 -1.839130178286793871e-01
1.107221570160134206e+03 -1.710166866123112930e-02
1.168092579632833576e+03 -3.057351270827571854e-01
1.232310055516668172e+03 -1.106781748246198904e-01
1.300057974347233085e+03 -3.303868040165114373e-01
1.371530427020012212e+03 -4.725865279814677189e-01
1.446932174841053666e+03 -2.575593280807353946e-01
1.526479236147279153e+03 -5.705864263687711047e-01
1.610399505177046422e+03 -1.536724784576679881e-01
1.698933404963958083e+03 -3.145682072531384987e-01
1.792334576124389741e+03 -1.848909614799560674e-01
1.890870603512058324e+03 -2.377833053646949135e-01
1.994823782821403483e+03 -4.020604703957555981e-01
2.104491929336042176e+03 -2.344975626829674253e-01
2.220189231139245749e+03 -2.197479461440884352e-01
2.342247149230851392e+03 -1.478388660343207817e-01
2.471015367129292372e+03 -2.275007150771282682e-01
2.606862792679321956e+03 -1.975851197380044943e-01
2.750178614935443875e+03 -2.696038901427675327e-01
2.901373419148966150e+03 -2.305124871731880631e-01
3.060880363052990560e+03 -1.196644296803352492e-01
3.229156417815228906e+03 -1.353069748023270624e-01
3.406683677213936335e+03 -2.863351718005205937e-01
3.593970738787522805e+03 -1.392835780668797430e-01
3.791554160914766726e+03 -2.082921603221027096e-01
4.000000000000000000e+03 -1.445183115319922385e-01
