# Frequency    Median mag            Median phase (Rad)    16th percentile mag   16th percentile phase 84th percentile mag   84th percentile phase
+1.0000000e+01 +1.0099473e+00 -1.2531012e-02 +9.3760742e-01 -3.8727663e-02 +1.0830574e+00 +1.3714172e-02
+1.0647838e+01 +1.0090517e+00 -1.4184849e-02 +9.3644776e-01 -3.5034515e-02 +1.0796463e+00 +7.3807979e-03
+1.1337646e+01 +1.0065924e+00 -1.4079341e-02 +9.3498528e-01 -3.3872991e-02 +1.0726324e+00 +6.9974236e-03
+1.2072142e+01 +1.0042378e+00 -1.3447122e-02 +9.3843434e-01 -3.5865063e-02 +1.0626713e+00 +8.8806079e-03
+1.2854222e+01 +1.0009743e+00 -1.3295564e-02 +9.4133898e-01 -3.8734714e-02 +1.0546563e+00 +1.2034802e-02
+1.3686967e+01 +9.9830696e-01 -1.2755855e-02 +9.4521466e-01 -4.2288410e-02 +1.0467616e+00 +1.5706409e-02
+1.4573661e+01 +9.9602234e-01 -1.1830509e-02 +9.4883963e-01 -4.3556995e-02 +1.0379170e+00 +1.9585923e-02
+1.5517799e+01 +9.9297097e-01 -1.1177022e-02 +9.5266874e-01 -4.4117272e-02 +1.0315619e+00 +2.3612131e-02
+1.6523101e+01 +9.9092265e-01 -8.9308885e-03 +9.5452599e-01 -4.3121432e-02 +1.0261407e+00 +2.5509637e-02
+1.7593531e+01 +9.8992336e-01 -8.1626031e-03 +9.5719633e-01 -4.2099049e-02 +1.0225705e+00 +2.8755271e-02
+1.8733307e+01 +9.8838413e-01 -7.2091906e-03 +9.5966254e-01 -4.0333252e-02 +1.0186454e+00 +3.1083269e-02
+1.9946923e+01 +9.8841128e-01 -4.4677996e-03 +9.6138733e-01 -3.8903206e-02 +1.0159329e+00 +3.4663047e-02
+2.1239161e+01 +9.8798826e-01 -2.5612759e-03 +9.6067846e-01 -3.6710236e-02 +1.0155729e+00 +3.6349292e-02
+2.2615115e+01 +9.8893319e-01 -8.1208848e-04 +9.6008295e-01 -3.4479630e-02 +1.0143430e+00 +3.7617312e-02
+2.4080208e+01 +9.8921929e-01 +1.1150197e-03 +9.5968007e-01 -3.3475685e-02 +1.0162773e+00 +3.9003042e-02
+2.5640216e+01 +9.9003902e-01 +3.4810350e-03 +9.5952138e-01 -3.2871497e-02 +1.0178030e+00 +4.0492451e-02
+2.7301288e+01 +9.9039891e-01 +4.6922159e-03 +9.5959525e-01 -3.1509244e-02 +1.0191494e+00 +4.0862296e-02
+2.9069970e+01 +9.9156543e-01 +5.4768054e-03 +9.5845102e-01 -3.0748793e-02 +1.0208913e+00 +4.0740434e-02
+3.0953234e+01 +9.9140199e-01 +6.5477450e-03 +9.5843538e-01 -2.9515603e-02 +1.0232510e+00 +4.1336448e-02
+3.2958502e+01 +9.9236885e-01 +7.7309016e-03 +9.5853736e-01 -2.8499638e-02 +1.0261673e+00 +4.1060706e-02
+3.5093680e+01 +9.9389882e-01 +7.8303606e-03 +9.5824801e-01 -2.7051213e-02 +1.0286728e+00 +4.1559262e-02
+3.7367183e+01 +9.9464613e-01 +8.3957371e-03 +9.5653838e-01 -2.4816316e-02 +1.0309790e+00 +4.1283362e-02
+3.9787972e+01 +9.9521836e-01 +8.7871982e-03 +9.5537684e-01 -2.2710918e-02 +1.0341274e+00 +3.9072469e-02
+4.2365590e+01 +9.9704790e-01 +8.7130197e-03 +9.5524265e-01 -2.1475983e-02 +1.0374535e+00 +3.7484262e-02
+4.5110195e+01 +9.9808980e-01 +8.5621963e-03 +9.5515538e-01 -1.9120320e-02 +1.0408793e+00 +3.5054683e-02
+4.8032606e+01 +9.9834441e-01 +8.9451088e-03 +9.5345115e-01 -1.6519244e-02 +1.0436049e+00 +3.4110306e-02
+5.1144342e+01 +9.9840498e-01 +8.5272255e-03 +9.5333104e-01 -1.4533258e-02 +1.0467842e+00 +3.3126285e-02
+5.4457668e+01 +9.9993971e-01 +8.4865459e-03 +9.5407274e-01 -1.4764226e-02 +1.0492049e+00 +3.2092802e-02
+5.7985644e+01 +1.0005694e+00 +8.0531468e-03 +9.5342148e-01 -1.5305470e-02 +1.0501485e+00 +3.2123037e-02
+6.1742176e+01 +1.0008777e+00 +7.3736372e-03 +9.5431328e-01 -1.7859187e-02 +1.0501529e+00 +3.2830022e-02
+6.5742070e+01 +1.0015272e+00 +6.7423832e-03 +9.5553922e-01 -2.0053117e-02 +1.0488404e+00 +3.4179150e-02
+7.0001093e+01 +1.0015189e+00 +6.0740705e-03 +9.5734790e-01 -2.4477264e-02 +1.0479501e+00 +3.8639990e-02
+7.4536032e+01 +1.0019009e+00 +5.9078159e-03 +9.5982546e-01 -2.9199431e-02 +1.0458363e+00 +4.3329208e-02
+7.9364761e+01 +1.0037161e+00 +4.9987043e-03 +9.6372756e-01 -3.3429045e-02 +1.0438442e+00 +4.7136292e-02
+8.4506314e+01 +1.0038271e+00 +5.1473172e-03 +9.6749974e-01 -3.8854727e-02 +1.0407333e+00 +4.9933961e-02
+8.9980956e+01 +1.0030599e+00 +4.4696696e-03 +9.7299636e-01 -4.2573779e-02 +1.0372006e+00 +5.3941820e-02
+9.5810267e+01 +1.0032538e+00 +3.5878174e-03 +9.7852881e-01 -4.5978299e-02 +1.0319453e+00 +5.6596086e-02
+1.0201722e+02 +1.0043344e+00 +2.9806829e-03 +9.8463733e-01 -4.8230102e-02 +1.0264151e+00 +5.8248253e-02
+1.0862629e+02 +1.0054379e+00 +2.1198056e-03 +9.8919468e-01 -5.1782648e-02 +1.0223015e+00 +5.7797721e-02
+1.1566352e+02 +1.0051851e+00 +9.5456191e-04 +9.9103767e-01 -5.3313135e-02 +1.0203105e+00 +5.7120998e-02
+1.2315664e+02 +1.0048470e+00 +1.8556080e-03 +9.9037439e-01 -5.3360213e-02 +1.0222351e+00 +5.5447671e-02
+1.3113520e+02 +1.0047122e+00 +1.0004940e-03 +9.8659546e-01 -5.0781316e-02 +1.0262674e+00 +5.3765830e-02
+1.3963064e+02 +1.0042997e+00 -4.0784850e-04 +9.8136075e-01 -4.7901307e-02 +1.0300384e+00 +4.9075133e-02
+1.4867645e+02 +1.0042729e+00 -7.5231578e-04 +9.7721665e-01 -4.4494942e-02 +1.0342682e+00 +4.5231283e-02
+1.5830827e+02 +1.0036841e+00 -1.6620949e-03 +9.7295354e-01 -4.1081692e-02 +1.0372924e+00 +4.0515610e-02
+1.6856409e+02 +1.0038496e+00 -3.1419875e-03 +9.6984804e-01 -3.7087867e-02 +1.0405232e+00 +3.5438824e-02
+1.7948432e+02 +1.0029952e+00 -3.9665306e-03 +9.6791028e-01 -3.3802797e-02 +1.0412177e+00 +2.9399406e-02
+1.9111200e+02 +1.0019096e+00 -4.4860370e-03 +9.6727962e-01 -2.8983797e-02 +1.0409304e+00 +2.3472052e-02
+2.0349296e+02 +1.0006877e+00 -3.9102807e-03 +9.6831320e-01 -2.4921097e-02 +1.0402035e+00 +1.8409650e-02
+2.1667602e+02 +1.0005487e+00 -3.8886118e-03 +9.7027359e-01 -2.0809948e-02 +1.0370305e+00 +1.4546268e-02
+2.3071312e+02 +9.9997440e-01 -3.6473570e-03 +9.7255609e-01 -1.8069595e-02 +1.0341714e+00 +1.1736635e-02
+2.4565960e+02 +9.9956028e-01 -3.3059581e-03 +9.7458741e-01 -1.6114190e-02 +1.0298041e+00 +9.7860323e-03
+2.6157437e+02 +9.9972590e-01 -2.9426671e-03 +9.7750805e-01 -1.4732008e-02 +1.0262877e+00 +8.5999016e-03
+2.7852016e+02 +1.0002857e+00 -2.8890550e-03 +9.7991121e-01 -1.4192901e-02 +1.0230918e+00 +8.2005170e-03
+2.9656376e+02 +1.0006194e+00 -3.0036911e-03 +9.8220595e-01 -1.3442737e-02 +1.0209132e+00 +7.9104994e-03
+3.1577629e+02 +1.0009640e+00 -3.0794922e-03 +9.8396361e-01 -1.3256932e-02 +1.0188715e+00 +7.7759244e-03
+3.3623349e+02 +1.0010199e+00 -3.3279582e-03 +9.8530862e-01 -1.3359822e-02 +1.0169955e+00 +7.3199169e-03
+3.5801598e+02 +1.0012902e+00 -3.5424390e-03 +9.8674046e-01 -1.3416740e-02 +1.0156412e+00 +7.4755054e-03
+3.8120963e+02 +1.0011781e+00 -3.4569033e-03 +9.8764615e-01 -1.3773973e-02 +1.0142042e+00 +7.5454631e-03
+4.0590584e+02 +1.0012578e+00 -3.4520441e-03 +9.8855165e-01 -1.4132330e-02 +1.0136857e+00 +7.9592286e-03
+4.3220198e+02 +1.0021615e+00 -2.8781431e-03 +9.8975723e-01 -1.5707500e-02 +1.0151993e+00 +1.1035087e-02
+4.6020168e+02 +1.0022404e+00 -2.2455750e-03 +9.9047292e-01 -1.5044167e-02 +1.0150759e+00 +1.1396230e-02
+4.9001530e+02 +1.0022384e+00 -3.9873935e-03 +9.8835268e-01 -1.6393076e-02 +1.0166745e+00 +8.1750172e-03
+5.2176037e+02 +1.0022475e+00 -4.0613502e-03 +9.8867095e-01 -1.7141142e-02 +1.0168847e+00 +8.0656611e-03
+5.5556200e+02 +1.0028600e+00 -5.5578813e-03 +9.8708233e-01 -1.8595653e-02 +1.0192010e+00 +6.3972490e-03
+5.9155343e+02 +1.0019062e+00 -5.1515510e-03 +9.8826346e-01 -1.7933381e-02 +1.0165372e+00 +6.7309633e-03
+6.2987653e+02 +1.0026193e+00 -4.7910117e-03 +9.8874315e-01 -1.9224971e-02 +1.0175229e+00 +8.0715048e-03
+6.7068234e+02 +1.0030813e+00 -5.5462313e-03 +9.8824900e-01 -2.0583948e-02 +1.0184683e+00 +9.0342997e-03
+7.1413171e+02 +1.0034476e+00 -5.9761889e-03 +9.8747197e-01 -2.2111985e-02 +1.0200391e+00 +9.4898924e-03
+7.6039589e+02 +1.0037254e+00 -6.7151748e-03 +9.8666115e-01 -2.3835665e-02 +1.0209213e+00 +9.3019938e-03
+8.0965725e+02 +1.0040783e+00 -7.2452636e-03 +9.8500763e-01 -2.6058275e-02 +1.0223010e+00 +9.5902432e-03
+8.6210994e+02 +1.0040459e+00 -8.4244607e-03 +9.8395816e-01 -2.7871720e-02 +1.0238666e+00 +1.0618084e-02
+9.1796072e+02 +1.0044853e+00 -9.2980434e-03 +9.8235649e-01 -2.9880713e-02 +1.0255835e+00 +1.0860150e-02
+9.7742973e+02 +1.0050047e+00 -9.8575909e-03 +9.8167908e-01 -3.1756540e-02 +1.0269672e+00 +1.1847695e-02
+1.0407514e+03 +1.0055850e+00 -1.0491841e-02 +9.8009383e-01 -3.4079349e-02 +1.0288453e+00 +1.2869751e-02
+1.1081752e+03 +1.0054954e+00 -1.1256515e-02 +9.7899712e-01 -3.6457187e-02 +1.0301407e+00 +1.3331862e-02
+1.1799671e+03 +1.0060177e+00 -1.1884882e-02 +9.7786774e-01 -3.8883469e-02 +1.0325408e+00 +1.4796821e-02
+1.2564098e+03 +1.0064104e+00 -1.2778419e-02 +9.7640142e-01 -4.1444797e-02 +1.0348062e+00 +1.6121166e-02
+1.3378049e+03 +1.0061933e+00 -1.3894332e-02 +9.7468929e-01 -4.4308449e-02 +1.0373451e+00 +1.6814604e-02
+1.4244730e+03 +1.0059619e+00 -1.5228158e-02 +9.7259003e-01 -4.6870084e-02 +1.0398856e+00 +1.7307889e-02
+1.5167558e+03 +1.0058291e+00 -1.6278465e-02 +9.7194874e-01 -4.9428463e-02 +1.0425324e+00 +1.8498976e-02
+1.6150171e+03 +1.0055569e+00 -1.7840988e-02 +9.7095748e-01 -5.2531089e-02 +1.0454010e+00 +1.9257357e-02
+1.7196440e+03 +1.0057813e+00 -1.8850469e-02 +9.6875216e-01 -5.6353044e-02 +1.0481244e+00 +2.0649021e-02
+1.8310492e+03 +1.0056713e+00 -1.9836788e-02 +9.6622510e-01 -6.0737723e-02 +1.0509021e+00 +2.2080600e-02
+1.9496715e+03 +1.0068131e+00 -2.1382694e-02 +9.6446690e-01 -6.4086524e-02 +1.0538970e+00 +2.3906478e-02
+2.0759787e+03 +1.0070222e+00 -2.2674796e-02 +9.6200482e-01 -6.7245453e-02 +1.0568970e+00 +2.5147612e-02
+2.2104686e+03 +1.0069405e+00 -2.3782789e-02 +9.6005897e-01 -7.0958267e-02 +1.0604793e+00 +2.6962074e-02
+2.3536712e+03 +1.0071171e+00 -2.4811936e-02 +9.5854699e-01 -7.4900924e-02 +1.0636593e+00 +2.8647398e-02
+2.5061510e+03 +1.0072575e+00 -2.6641012e-02 +9.5773870e-01 -7.9570493e-02 +1.0663363e+00 +2.9404248e-02
+2.6685090e+03 +1.0077517e+00 -2.8315730e-02 +9.5533342e-01 -8.4191028e-02 +1.0703127e+00 +3.0110852e-02
+2.8413853e+03 +1.0091064e+00 -2.9923672e-02 +9.5329849e-01 -8.8667077e-02 +1.0735707e+00 +3.0548408e-02
+3.0254611e+03 +1.0086991e+00 -3.1215149e-02 +9.5102548e-01 -9.3641590e-02 +1.0782811e+00 +3.1400202e-02
+3.2214620e+03 +1.0089502e+00 -3.3401689e-02 +9.4892807e-01 -9.8530536e-02 +1.0828940e+00 +3.2780888e-02
+3.4301607e+03 +1.0094289e+00 -3.5713149e-02 +9.4639390e-01 -1.0249628e-01 +1.0866282e+00 +3.3312414e-02
+3.6523796e+03 +1.0103818e+00 -3.7442410e-02 +9.4350974e-01 -1.0756524e-01 +1.0910029e+00 +3.4687619e-02
+3.8889947e+03 +1.0110811e+00 -4.0163465e-02 +9.4042004e-01 -1.1355171e-01 +1.0953854e+00 +3.5380315e-02
+4.1409387e+03 +1.0109705e+00 -4.2239449e-02 +9.3677014e-01 -1.2003724e-01 +1.1003975e+00 +3.5615596e-02
+4.4092045e+03 +1.0117963e+00 -4.4931668e-02 +9.3428171e-01 -1.2528006e-01 +1.1048020e+00 +3.5872550e-02
+4.6948497e+03 +1.0115723e+00 -4.7488286e-02 +9.3174884e-01 -1.3213210e-01 +1.1100259e+00 +3.7619906e-02
+4.9990000e+03 +1.0131872e+00 -5.0879932e-02 +9.2879265e-01 -1.3871789e-01 +1.1159218e+00 +3.7857753e-02
