2.000000000000000000e+01 5.318563187296629748e-45 3.549495982829497350e-46 3.121615324429411457e-46
2.109952716083550328e+01 4.408893164003520564e-45 2.993622280454053751e-46 2.363241765543942924e-46
2.225950232054175615e+01 3.608714017995745555e-45 2.512604210547394519e-46 1.764885319172682578e-46
2.348324868994759740e+01 2.781834327295877041e-45 1.976661074385988200e-46 1.332380649281807224e-46
2.477427217791020198e+01 2.006045251102971141e-45 1.516184439206349568e-46 9.413130219744059753e-47
2.613627143538737840e+01 1.611335917461755089e-45 1.310946387122870119e-46 6.722102364936236214e-47
2.757314845169625528e+01 1.114478242010465914e-45 9.795146235211685923e-47 4.331333872588219997e-47
2.908901973331572677e+01 9.860139455474376563e-46 9.226004120308228433e-47 3.625449567617951540e-47
3.068822809725876866e+01 6.761071428687597397e-46 6.873301738897807229e-47 2.227647335122798944e-47
3.237535511280132994e+01 5.239678918690687158e-46 5.622947412042000754e-47 1.695878527176378747e-47
3.415523422721231128e+01 4.302463335843137419e-46 4.755019068185338817e-47 1.454068631868330687e-47
3.603296461308822529e+01 2.606294446921930509e-46 2.958870794791726379e-47 1.005176409181502780e-47
3.801392577696397979e+01 1.673259641721888135e-46 1.952038712404598325e-47 7.273910701899297100e-48
4.010379297105183127e+01 1.365401927256633232e-46 1.623078953539539565e-47 6.358264872822115743e-48
4.230855345226157738e+01 8.155713865180863567e-47 9.975075932908028610e-48 4.723178027842500639e-48
4.463452363508271503e+01 5.057086464126749709e-47 6.550816637449510336e-48 3.375968804622410670e-48
4.708836718746909611e+01 2.330532484233668205e-47 3.396124522271820292e-48 2.246030592032771504e-48
4.967711412156997142e+01 7.630720890488928828e-48 1.912748804255847179e-48 1.717621595011322455e-48
5.240818093399955302e+01 -2.681008898604850684e-48 1.513637088286280949e-48 1.483048127654855823e-48
5.528939185334521511e+01 -8.949658167798102136e-48 1.730822066596383175e-48 1.408541680845648914e-48
5.832900125578675699e+01 -1.187200753113601948e-47 1.977466120967282398e-48 1.515303926524331542e-48
6.153571731304403869e+01 -1.059407082273945866e-47 1.741612154407285031e-48 1.311839553887711421e-48
6.491872694040340264e+01 -1.153756711703141867e-47 1.762733892867639274e-48 1.307518165988659438e-48
6.848772211629528783e+01 -6.991693506622031069e-48 1.247082476393403159e-48 1.066901927159935027e-48
7.225292764882630081e+01 -9.110774225995300158e-48 1.455321261743052722e-48 1.215276640320020275e-48
7.622513046881468313e+01 -1.479192266673371104e-49 9.193275779498134062e-49 9.192443550871361452e-49
8.041571053324926766e+01 2.003205130584208348e-48 9.734105246112165024e-49 9.625509512560994801e-49
8.483667342770891651e+01 9.050114513160357377e-48 1.393738307009078878e-48 1.276905940693696509e-48
8.950068476114380189e+01 1.409641177345616999e-47 1.271139884125752341e-48 1.103458932994984148e-48
9.442110645155648285e+01 1.865887810145630342e-47 1.347969898450091271e-48 1.136862924964598569e-48
9.961203500653786591e+01 2.293094818067207145e-47 1.397034407444743471e-48 1.143724833087565204e-48
1.050883419083271804e+02 2.768218239218667308e-47 1.415430861830808382e-48 1.133719338009592488e-48
1.108657162190958019e+02 3.122448032710582415e-47 1.390631937868352023e-48 1.133486158943189209e-48
1.169607095285145846e+02 3.513419174791982136e-47 1.425513638098041382e-48 1.247232939231193052e-48
1.233907833723743153e+02 4.042453103911379346e-47 1.472016346101717271e-48 1.524264297884809867e-48
1.301743592581091491e+02 4.210319174282111722e-47 1.691137244567633852e-48 1.837353286825507420e-48
1.373308714405416993e+02 4.686802366022940623e-47 2.548991133669054705e-48 1.950349837708016051e-48
1.448808225990458141e+02 4.872553772398573970e-47 2.840684784072219913e-48 2.466329070936615279e-48
1.528458425756377892e+02 5.368036072805625648e-47 3.346344192322967250e-48 3.140841015434302373e-48
1.612487503422729276e+02 5.570555835181139160e-47 3.905420833069815820e-48 3.454246734073086543e-48
1.701136193748786241e+02 5.899449899199973742e-47 4.284470598335813759e-48 3.978050052043695609e-48
1.794658466214141015e+02 6.198164423422605287e-47 4.817234252788805404e-48 4.015153379298488612e-48
1.893322252615433570e+02 6.569829474200596259e-47 5.304873982729637268e-48 4.017036711115661491e-48
1.997410214663678971e+02 6.833057693787160373e-47 5.610981118424966454e-48 3.881638561428890191e-48
2.107220553781329215e+02 7.018420594162959646e-47 5.645821071380662338e-48 3.750321250713598087e-48
2.223067865419000384e+02 7.382389703630553860e-47 5.630865470511733131e-48 3.675310038350553294e-48
2.345284040339441276e+02 7.656323639173516422e-47 5.402503231185479068e-48 3.483241098769308308e-48
2.474219215450802096e+02 8.077452200422604814e-47 5.139865411871697523e-48 3.373030050291961827e-48
2.610242776913264038e+02 8.358938822841397421e-47 4.702325495074180241e-48 3.175696746305928958e-48
2.753744418392806210e+02 8.533834204386771377e-47 4.410774937203487453e-48 3.000205227227385280e-48
2.905135257493910217e+02 8.865845505007546968e-47 4.165763587090101000e-48 2.938675887856183281e-48
3.064849013569681802e+02 9.365341133649105683e-47 4.018907670567958551e-48 2.907344370986555962e-48
3.233343250283667771e+02 9.773921182703475832e-47 3.882459416695102217e-48 2.795098099296763359e-48
3.411100686483218283e+02 1.028103193036985848e-46 3.854426009285049994e-48 2.688531239656646859e-48
3.598630579139866086e+02 1.064212127426435705e-46 3.863936331666725554e-48 2.544639724508194021e-48
3.796470182318741990e+02 1.143275268934926271e-46 4.145749937693603161e-48 2.398309377539347670e-48
4.005186286356818073e+02 1.204577732606867593e-46 4.256277271336003978e-48 2.282418374981785254e-48
4.225376841659580691e+02 1.257888267785571504e-46 4.591029578300968850e-48 2.277086806318530578e-48
4.457672671768079908e+02 1.321683145865947224e-46 4.788462185505435834e-48 2.316836971578542378e-48
4.702739280604240548e+02 1.400095914801482554e-46 5.070055042322814841e-48 2.532320723158635885e-48
4.961278759071861941e+02 1.476521158491876922e-46 5.692482073570526346e-48 2.914584019533415976e-48
5.234031796475647980e+02 1.592605378959331712e-46 6.199841775564696513e-48 3.013466830753006080e-48
5.521779802520730982e+02 1.674516059966971337e-46 6.668332468703373709e-48 3.839917318043204517e-48
5.825347145971950340e+02 1.799702266331388420e-46 6.683800786288247759e-48 3.919328545155326477e-48
6.145603516386539695e+02 1.914257484983912548e-46 7.202972277868017951e-48 3.926314816605568329e-48
6.483466415686201572e+02 2.079776074811756695e-46 8.214128842555198214e-48 4.383797622426067651e-48
6.839903786706787514e+02 2.226447076257306911e-46 9.116830782200840096e-48 5.128186423790392782e-48
7.215936786256077085e+02 2.414348628559092682e-46 1.018979899641603301e-47 5.986749146730575722e-48
7.612642710624102165e+02 2.595141108174162167e-46 1.162199533365322481e-47 6.756310872938491732e-48
8.031158081927486592e+02 2.790630745468366529e-46 1.272469505559692902e-47 8.093012023653526496e-48
8.472681904129632358e+02 3.035497026018027232e-46 1.434250336384440244e-47 9.496368269264257731e-48
8.938479098065128028e+02 3.272954502166412778e-46 1.641622302646750432e-47 1.071790214415504962e-47
9.429884125309283718e+02 3.606176074065135497e-46 1.900664617310312463e-47 1.271382543583386166e-47
9.948304811274733765e+02 3.900401726071119692e-46 2.136969086884142745e-47 1.516237572275123715e-47
1.049522637848809154e+03 4.331957977837053443e-46 2.487364584880692656e-47 1.826989114598362828e-47
1.107221570160134206e+03 4.730792005949090826e-46 2.730454119962611832e-47 2.257851057209635062e-47
1.168092579632833576e+03 5.190274598995655555e-46 3.307957317082248422e-47 2.547201790486701517e-47
1.232310055516668172e+03 5.698708599184967171e-46 4.036731477619048039e-47 2.861013107311199809e-47
1.300057974347233085e+03 6.208381223908720831e-46 4.689450365708402598e-47 3.304497460621310117e-47
1.371530427020012212e+03 6.894239172198264196e-46 5.349659701409921881e-47 4.062564544113785351e-47
1.446932174841053666e+03 7.581253100423860629e-46 6.041539982966682999e-47 4.933246982189637085e-47
1.526479236147279153e+03 8.467079737436304474e-46 7.178103763645313138e-47 5.751544903890422362e-47
1.610399505177046422e+03 9.241424706974459352e-46 8.075496639238031406e-47 6.708931789311150338e-47
1.698933404963958083e+03 1.018788442783016655e-45 9.375367936557857112e-47 7.793523935311941055e-47
1.792334576124389741e+03 1.133182067602640481e-45 1.079773829791529725e-46 9.265383344294236486e-47
1.890870603512058324e+03 1.237380573934766127e-45 1.219894921461919367e-46 1.091727753867255665e-46
1.994823782821403483e+03 1.396464851731021021e-45 1.435802341537118267e-46 1.321141410837411443e-46
2.104491929336042176e+03 1.519687702498692391e-45 1.632632179276908827e-46 1.525688387070200056e-46
2.220189231139245749e+03 1.680654980942820160e-45 1.861955274907868782e-46 1.797152059001340669e-46
2.342247149230851392e+03 1.880529710980702310e-45 2.156385951342637457e-46 2.113542928283436629e-46
2.471015367129292372e+03 2.072783026251208944e-45 2.483291777537988159e-46 2.436578237137515960e-46
2.606862792679321956e+03 2.309414626584748447e-45 2.883033383999623270e-46 2.850923585259152508e-46
2.750178614935443875e+03 2.549366313949755437e-45 3.288289962117982099e-46 3.338355046755887719e-46
2.901373419148966150e+03 2.828946518920735915e-45 3.759642196450755311e-46 3.919014169712971952e-46
3.060880363052990560e+03 3.134548532982641496e-45 4.306917928269945726e-46 4.543803486376901711e-46
3.229156417815228906e+03 3.485212912624552156e-45 4.934390583433194935e-46 5.330713165391483120e-46
3.406683677213936335e+03 3.924617365028892967e-45 5.708724697175423316e-46 6.280433632951778577e-46
3.593970738787522805e+03 4.293196660783410897e-45 6.442973345304983213e-46 7.130763349817652730e-46
3.791554160914766726e+03 4.770428008018433930e-45 7.370645638082940275e-46 8.208492207663052778e-46
4.000000000000000000e+03 5.310831812862579913e-45 8.409553542314186390e-46 9.547397975516201213e-46
