# Frequency    Median mag            Median phase (Rad)    16th percentile mag   16th percentile phase 84th percentile mag   84th percentile phase
+1.0000000e+01 +1.0093715e+00 -1.2641718e-02 +9.3112285e-01 -3.8612262e-02 +1.0835651e+00 +1.3915876e-02
+1.0647838e+01 +1.0070671e+00 -1.2779526e-02 +9.3046746e-01 -3.3984530e-02 +1.0803117e+00 +9.2815951e-03
+1.1337646e+01 +1.0038059e+00 -1.1926304e-02 +9.3222529e-01 -3.3230661e-02 +1.0746958e+00 +7.8223435e-03
+1.2072142e+01 +1.0006914e+00 -1.2807130e-02 +9.3762689e-01 -3.3957397e-02 +1.0666179e+00 +1.0078571e-02
+1.2854222e+01 +9.9812060e-01 -1.2750793e-02 +9.4092234e-01 -3.6066404e-02 +1.0588270e+00 +1.4528762e-02
+1.3686967e+01 +9.9686399e-01 -1.1520881e-02 +9.4391441e-01 -3.8646062e-02 +1.0497640e+00 +1.9388038e-02
+1.4573661e+01 +9.9451729e-01 -1.0533535e-02 +9.4896412e-01 -4.1557304e-02 +1.0434278e+00 +2.3413467e-02
+1.5517799e+01 +9.9253349e-01 -8.6694030e-03 +9.5267131e-01 -4.2995984e-02 +1.0356853e+00 +2.5871372e-02
+1.6523101e+01 +9.9203239e-01 -7.9353829e-03 +9.5628382e-01 -4.1921673e-02 +1.0289619e+00 +2.9305486e-02
+1.7593531e+01 +9.9092621e-01 -5.4224349e-03 +9.5832282e-01 -4.1717703e-02 +1.0241800e+00 +3.1233885e-02
+1.8733307e+01 +9.9039462e-01 -3.6477898e-03 +9.6003840e-01 -4.0912737e-02 +1.0215838e+00 +3.4961814e-02
+1.9946923e+01 +9.9054862e-01 -2.3667284e-03 +9.6071381e-01 -3.9262457e-02 +1.0199195e+00 +3.5670991e-02
+2.1239161e+01 +9.8976176e-01 -1.7110306e-03 +9.6233259e-01 -3.7693933e-02 +1.0184654e+00 +3.7772912e-02
+2.2615115e+01 +9.9007243e-01 -6.1911185e-04 +9.6313219e-01 -3.6206243e-02 +1.0172111e+00 +3.9944378e-02
+2.4080208e+01 +9.9053620e-01 +7.5216763e-04 +9.6359030e-01 -3.4605516e-02 +1.0190471e+00 +4.1311510e-02
+2.5640216e+01 +9.9119041e-01 +1.6301791e-03 +9.6334220e-01 -3.2742077e-02 +1.0200200e+00 +4.2059054e-02
+2.7301288e+01 +9.9272541e-01 +3.1930297e-03 +9.6346377e-01 -3.1637191e-02 +1.0215441e+00 +4.2700223e-02
+2.9069970e+01 +9.9302879e-01 +4.6000746e-03 +9.6204462e-01 -3.0562329e-02 +1.0243466e+00 +4.3991241e-02
+3.0953234e+01 +9.9479642e-01 +5.9220118e-03 +9.6142617e-01 -2.9003761e-02 +1.0267928e+00 +4.4593724e-02
+3.2958502e+01 +9.9593230e-01 +6.3518471e-03 +9.6013922e-01 -2.8109635e-02 +1.0299053e+00 +4.4376034e-02
+3.5093680e+01 +9.9726212e-01 +7.0885715e-03 +9.5939786e-01 -2.7181212e-02 +1.0328242e+00 +4.1815394e-02
+3.7367183e+01 +9.9785842e-01 +7.6141764e-03 +9.5954260e-01 -2.6604171e-02 +1.0366595e+00 +4.0389794e-02
+3.9787972e+01 +9.9856481e-01 +8.1751139e-03 +9.5891333e-01 -2.4140953e-02 +1.0392356e+00 +3.9008334e-02
+4.2365590e+01 +9.9893804e-01 +7.6912973e-03 +9.5703772e-01 -2.2908686e-02 +1.0429517e+00 +3.7228751e-02
+4.5110195e+01 +1.0000996e+00 +7.7636761e-03 +9.5636067e-01 -2.0533393e-02 +1.0465427e+00 +3.4632297e-02
+4.8032606e+01 +1.0008903e+00 +7.4189089e-03 +9.5546272e-01 -1.9398709e-02 +1.0511076e+00 +3.3134390e-02
+5.1144342e+01 +1.0024205e+00 +6.6671192e-03 +9.5553620e-01 -1.7557858e-02 +1.0530125e+00 +3.0841425e-02
+5.4457668e+01 +1.0028906e+00 +6.4061215e-03 +9.5476724e-01 -1.7970971e-02 +1.0546926e+00 +2.8535419e-02
+5.7985644e+01 +1.0035765e+00 +5.8843399e-03 +9.5558359e-01 -1.7545390e-02 +1.0556186e+00 +2.7938954e-02
+6.1742176e+01 +1.0047676e+00 +4.2501086e-03 +9.5633017e-01 -1.9897048e-02 +1.0551460e+00 +2.9730509e-02
+6.5742070e+01 +1.0047693e+00 +2.7565695e-03 +9.5707486e-01 -2.3738710e-02 +1.0535915e+00 +3.2101222e-02
+7.0001093e+01 +1.0051222e+00 +9.7746207e-04 +9.5875075e-01 -2.7534218e-02 +1.0518807e+00 +3.5557703e-02
+7.4536032e+01 +1.0054031e+00 +3.7667919e-04 +9.6105249e-01 -3.1811092e-02 +1.0488753e+00 +3.8820944e-02
+7.9364761e+01 +1.0048270e+00 -3.5723667e-04 +9.6418385e-01 -3.7305511e-02 +1.0452759e+00 +4.2367091e-02
+8.4506314e+01 +1.0051279e+00 -1.0581681e-03 +9.6814329e-01 -4.2684995e-02 +1.0407778e+00 +4.5652208e-02
+8.9980956e+01 +1.0044670e+00 -1.5018094e-03 +9.7243115e-01 -4.7846876e-02 +1.0356286e+00 +4.8126371e-02
+9.5810267e+01 +1.0038285e+00 -2.2225955e-03 +9.7934985e-01 -5.1439531e-02 +1.0305981e+00 +5.0739974e-02
+1.0201722e+02 +1.0032262e+00 -3.1557132e-03 +9.8376630e-01 -5.5337271e-02 +1.0255497e+00 +5.1724540e-02
+1.0862629e+02 +1.0034147e+00 -4.1045663e-03 +9.8813108e-01 -5.6655140e-02 +1.0203739e+00 +5.1693277e-02
+1.1566352e+02 +1.0029202e+00 -4.3308261e-03 +9.9028428e-01 -5.7614848e-02 +1.0165563e+00 +5.0890794e-02
+1.2315664e+02 +1.0024943e+00 -4.6578903e-03 +9.8896679e-01 -5.7410763e-02 +1.0168631e+00 +5.0452964e-02
+1.3113520e+02 +1.0012979e+00 -4.5501967e-03 +9.8489254e-01 -5.5659966e-02 +1.0198872e+00 +4.8481671e-02
+1.3963064e+02 +1.0007542e+00 -3.9678398e-03 +9.8022677e-01 -5.2794899e-02 +1.0240093e+00 +4.5968895e-02
+1.4867645e+02 +9.9998149e-01 -3.8201969e-03 +9.7515030e-01 -5.0009158e-02 +1.0278463e+00 +4.2240485e-02
+1.5830827e+02 +1.0001644e+00 -3.7107051e-03 +9.7025135e-01 -4.3841316e-02 +1.0316843e+00 +3.6889073e-02
+1.6856409e+02 +9.9956563e-01 -3.1718501e-03 +9.6750795e-01 -3.9831167e-02 +1.0342302e+00 +3.1499224e-02
+1.7948432e+02 +9.9908260e-01 -3.5956621e-03 +9.6551051e-01 -3.3801939e-02 +1.0347533e+00 +2.5381710e-02
+1.9111200e+02 +9.9858282e-01 -4.0823290e-03 +9.6528775e-01 -2.9097263e-02 +1.0346773e+00 +2.0194199e-02
+2.0349296e+02 +9.9792605e-01 -4.2987972e-03 +9.6606101e-01 -2.4299502e-02 +1.0327699e+00 +1.6245805e-02
+2.1667602e+02 +9.9754555e-01 -3.8205057e-03 +9.6704958e-01 -2.0795007e-02 +1.0298991e+00 +1.2571747e-02
+2.3071312e+02 +9.9762898e-01 -3.5595293e-03 +9.6929920e-01 -1.7932158e-02 +1.0272383e+00 +1.0326669e-02
+2.4565960e+02 +9.9736532e-01 -3.1667562e-03 +9.7269892e-01 -1.5531490e-02 +1.0236382e+00 +9.4448003e-03
+2.6157437e+02 +9.9770130e-01 -2.9129978e-03 +9.7557387e-01 -1.4174175e-02 +1.0207328e+00 +8.5803330e-03
+2.7852016e+02 +9.9780252e-01 -2.4832282e-03 +9.7842528e-01 -1.3157992e-02 +1.0178796e+00 +7.9939581e-03
+2.9656376e+02 +9.9799225e-01 -2.3610686e-03 +9.8117279e-01 -1.2877123e-02 +1.0166545e+00 +7.7549439e-03
+3.1577629e+02 +9.9847341e-01 -2.4859574e-03 +9.8357098e-01 -1.2834838e-02 +1.0150239e+00 +7.6791605e-03
+3.3623349e+02 +9.9903366e-01 -2.7881365e-03 +9.8519191e-01 -1.3213850e-02 +1.0140927e+00 +7.6835621e-03
+3.5801598e+02 +9.9945498e-01 -2.9096210e-03 +9.8667765e-01 -1.3293578e-02 +1.0131466e+00 +7.0838378e-03
+3.8120963e+02 +9.9972870e-01 -3.1907553e-03 +9.8772585e-01 -1.3695913e-02 +1.0122905e+00 +6.7774292e-03
+4.0590584e+02 +9.9986798e-01 -3.5169843e-03 +9.8865000e-01 -1.3777204e-02 +1.0117738e+00 +7.0871132e-03
+4.3220198e+02 +1.0008440e+00 -3.7070893e-03 +9.8945567e-01 -1.5443146e-02 +1.0127675e+00 +8.6076426e-03
+4.6020168e+02 +1.0010949e+00 -3.5043934e-03 +9.9031275e-01 -1.5491836e-02 +1.0128548e+00 +9.1114018e-03
+4.9001530e+02 +1.0009960e+00 -4.8606840e-03 +9.8826480e-01 -1.6062142e-02 +1.0135349e+00 +6.4309473e-03
+5.2176037e+02 +1.0010721e+00 -5.2923291e-03 +9.8819472e-01 -1.6428409e-02 +1.0138004e+00 +6.3732019e-03
+5.5556200e+02 +1.0009101e+00 -6.5585173e-03 +9.8677903e-01 -1.7925521e-02 +1.0149837e+00 +5.6085131e-03
+5.9155343e+02 +1.0007352e+00 -6.0049957e-03 +9.8770356e-01 -1.7282297e-02 +1.0136991e+00 +6.0822251e-03
+6.2987653e+02 +1.0012041e+00 -6.2910579e-03 +9.8801291e-01 -1.8814667e-02 +1.0147789e+00 +6.7042988e-03
+6.7068234e+02 +1.0014870e+00 -6.8198735e-03 +9.8749070e-01 -2.0198670e-02 +1.0156539e+00 +7.1298723e-03
+7.1413171e+02 +1.0019747e+00 -7.7657796e-03 +9.8691281e-01 -2.1866728e-02 +1.0168350e+00 +7.5128039e-03
+7.6039589e+02 +1.0020365e+00 -8.1711415e-03 +9.8627441e-01 -2.3822868e-02 +1.0185272e+00 +8.4508229e-03
+8.0965725e+02 +1.0020465e+00 -8.5427624e-03 +9.8491910e-01 -2.5802266e-02 +1.0205061e+00 +8.8702479e-03
+8.6210994e+02 +1.0019653e+00 -9.5337967e-03 +9.8358553e-01 -2.7856256e-02 +1.0220546e+00 +9.0622435e-03
+9.1796072e+02 +1.0013382e+00 -9.8873431e-03 +9.8215942e-01 -2.9846618e-02 +1.0234613e+00 +9.8447827e-03
+9.7742973e+02 +1.0018372e+00 -1.0219607e-02 +9.8094116e-01 -3.1933417e-02 +1.0249324e+00 +1.0525772e-02
+1.0407514e+03 +1.0020497e+00 -1.1059837e-02 +9.7957081e-01 -3.4394535e-02 +1.0265059e+00 +1.1311899e-02
+1.1081752e+03 +1.0022044e+00 -1.1963973e-02 +9.7810336e-01 -3.6611533e-02 +1.0280296e+00 +1.2545457e-02
+1.1799671e+03 +1.0026203e+00 -1.2737121e-02 +9.7643316e-01 -3.9465043e-02 +1.0297471e+00 +1.3637765e-02
+1.2564098e+03 +1.0025898e+00 -1.3584376e-02 +9.7491491e-01 -4.2666113e-02 +1.0322304e+00 +1.4663770e-02
+1.3378049e+03 +1.0024699e+00 -1.4206188e-02 +9.7273809e-01 -4.5693161e-02 +1.0341445e+00 +1.5492285e-02
+1.4244730e+03 +1.0028501e+00 -1.5235017e-02 +9.7103702e-01 -4.9262362e-02 +1.0369492e+00 +1.6704004e-02
+1.5167558e+03 +1.0031334e+00 -1.5692261e-02 +9.6916256e-01 -5.1951848e-02 +1.0397251e+00 +1.7870881e-02
+1.6150171e+03 +1.0031403e+00 -1.7046816e-02 +9.6733009e-01 -5.5551066e-02 +1.0427168e+00 +1.9095150e-02
+1.7196440e+03 +1.0030071e+00 -1.8788058e-02 +9.6525523e-01 -5.9166440e-02 +1.0452381e+00 +2.0290627e-02
+1.8310492e+03 +1.0030074e+00 -2.0099822e-02 +9.6286423e-01 -6.3139898e-02 +1.0476493e+00 +2.1094792e-02
+1.9496715e+03 +1.0031231e+00 -2.1716584e-02 +9.6043471e-01 -6.6659878e-02 +1.0502729e+00 +2.2224859e-02
+2.0759787e+03 +1.0038200e+00 -2.3147508e-02 +9.5824496e-01 -7.0501691e-02 +1.0529917e+00 +2.4082436e-02
+2.2104686e+03 +1.0032277e+00 -2.5113386e-02 +9.5547591e-01 -7.4782843e-02 +1.0558323e+00 +2.5433553e-02
+2.3536712e+03 +1.0027576e+00 -2.6200945e-02 +9.5298549e-01 -7.9102470e-02 +1.0599725e+00 +2.7237287e-02
+2.5061510e+03 +1.0028620e+00 -2.7619976e-02 +9.5045969e-01 -8.3760031e-02 +1.0640988e+00 +2.9213800e-02
+2.6685090e+03 +1.0031929e+00 -2.9330220e-02 +9.4802147e-01 -8.9275281e-02 +1.0679365e+00 +3.0297001e-02
+2.8413853e+03 +1.0034984e+00 -3.1343472e-02 +9.4438169e-01 -9.4899871e-02 +1.0713822e+00 +3.1409465e-02
+3.0254611e+03 +1.0034715e+00 -3.3590386e-02 +9.4108720e-01 -1.0036329e-01 +1.0753220e+00 +3.2426489e-02
+3.2214620e+03 +1.0041728e+00 -3.6277476e-02 +9.3920583e-01 -1.0541450e-01 +1.0792408e+00 +3.3053957e-02
+3.4301607e+03 +1.0048726e+00 -3.8568487e-02 +9.3682643e-01 -1.1140392e-01 +1.0832486e+00 +3.4625060e-02
+3.6523796e+03 +1.0049872e+00 -4.1172439e-02 +9.3345654e-01 -1.1701693e-01 +1.0876781e+00 +3.6130664e-02
+3.8889947e+03 +1.0049434e+00 -4.3802177e-02 +9.3101094e-01 -1.2338406e-01 +1.0915465e+00 +3.7302249e-02
+4.1409387e+03 +1.0048563e+00 -4.7012206e-02 +9.2862887e-01 -1.2864591e-01 +1.0958887e+00 +3.8476821e-02
+4.4092045e+03 +1.0050184e+00 -4.9038965e-02 +9.2613457e-01 -1.3584492e-01 +1.0999741e+00 +3.9516839e-02
+4.6948497e+03 +1.0050342e+00 -5.1015674e-02 +9.2340476e-01 -1.4335773e-01 +1.1051369e+00 +3.9479410e-02
+4.9990000e+03 +1.0059703e+00 -5.4516348e-02 +9.2120347e-01 -1.4988809e-01 +1.1106006e+00 +3.9607221e-02
