2.000000000000000000e+01 6.468196767694176687e-24
2.095231505579329578e+01 6.174207241987540487e-24
2.194997530986112722e+01 5.893579993949522633e-24
2.299513990795471585e+01 5.625707687437580608e-24
2.409007080517564958e+01 5.370010590674155586e-24
2.523713766132041059e+01 5.125935321585719494e-24
2.643882296932057940e+01 4.892953650168032168e-24
2.769772742787746722e+01 4.670561355285780962e-24
2.901657556991879261e+01 4.458277133432447267e-24
3.039822165905868090e+01 4.255641557088687056e-24
3.184565586682185057e+01 4.062216080424970404e-24
3.336201074400118927e+01 3.877582090196539182e-24
3.495056800015368026e+01 3.701339999776676285e-24
3.661476560590735829e+01 3.533108384367540495e-24
3.835820523344978028e+01 3.372523155517020553e-24
4.018466005130094487e+01 3.219236773155070817e-24
4.209808289024041983e+01 3.072917493444194770e-24
4.410261479806091955e+01 2.933248650816308006e-24
4.620259400166321484e+01 2.799927972642112713e-24
4.840256529588764778e+01 2.672666925049827159e-24
5.070728987940223220e+01 2.551190088477443083e-24
5.312175565893374340e+01 2.435234561607109769e-24
5.565118804414249354e+01 2.324549392391625737e-24
5.830106125650355153e+01 2.218895034941629449e-24
6.107711017666832021e+01 2.118042831098138699e-24
6.398534275594769838e+01 2.021774515568389633e-24
6.703205301877686395e+01 1.929881743554033586e-24
7.022383468430263065e+01 1.842165639849352879e-24
7.356759543657270228e+01 1.758436368433659336e-24
7.707057187421060007e+01 1.678512721626389900e-24
8.074034517193108229e+01 1.602221727915725499e-24
8.458485748778998925e+01 1.529398277612012446e-24
8.861242915167765943e+01 1.459884765515812917e-24
9.283177667225560015e+01 1.393530749827243090e-24
9.725203160130708113e+01 1.330192626558403768e-24
1.018827602963276178e+02 1.269733318744275228e-24
1.067339846241262649e+02 1.212021979779456241e-24
1.118162036502444749e+02 1.156933710238701060e-24
1.171404163611333615e+02 1.104349287568401396e-24
1.227181454682635291e+02 1.054154908064013185e-24
1.285614623456864081e+02 1.006241940575002036e-24
1.346830131550164538e+02 9.605066914042766794e-25
1.410960462143729330e+02 9.168501798933166114e-25
1.478144406705155234e+02 8.751779242072910552e-25
1.548527365362254216e+02 8.353997368565768552e-25
1.622261661579374561e+02 7.974295295121475105e-25
1.699506871817289664e+02 7.611851266923924520e-25
1.780430170890078898e+02 7.265880879181656639e-25
1.865206693766440083e+02 6.935635379511584940e-25
1.954019914598451635e+02 6.620400047481993830e-25
2.047062043798053992e+02 6.319492647807869255e-25
2.144534444020646617e+02 6.032261953850813511e-25
2.246648065956055689e+02 5.758086338228191503e-25
2.353623904869998569e+02 5.496372427481310028e-25
2.465693478884132048e+02 5.246553817890946158e-25
2.583099330029768339e+02 5.008089849661053966e-25
2.706095549159615530e+02 4.780464436817754433e-25
2.834948325853609958e+02 4.563184950291174950e-25
2.969936524508930233e+02 4.355781151762948242e-25
3.111352287860945012e+02 4.157804175972025937e-25
3.259501669241287232e+02 3.968825559276228353e-25
3.414705294941384750e+02 3.788436312367158859e-25
3.577299058114870718e+02 3.616246035131723871e-25
3.747634845720770613e+02 3.451882071744462557e-25
3.926081300080545589e+02 3.294988704162330173e-25
4.113024616697303486e+02 3.145226382276331407e-25
4.308869380063769654e+02 3.002270989053954477e-25
4.514039439267843363e+02 2.865813139082049824e-25
4.728978825290815280e+02 2.735557508991977661e-25
4.954152711983423387e+02 2.611222198317983284e-25
5.190048422799475247e+02 2.492538119405551434e-25
5.437176485465880660e+02 2.379248415049361063e-25
5.696071736871604116e+02 2.271107902600481901e-25
5.967294480566681614e+02 2.167882543339783897e-25
6.251431699376471443e+02 2.069348935969123586e-25
6.549098325755463748e+02 1.975293833124133190e-25
6.860938572629838745e+02 1.885513679862281062e-25
7.187627327609252461e+02 1.799814173127317256e-25
7.529871613584944043e+02 1.718009841236772822e-25
7.888412118875313581e+02 1.639923642482405580e-25
8.264024800230678238e+02 1.565386581974832967e-25
8.657522562166124089e+02 1.494237345903219988e-25
9.069757016257165105e+02 1.426321952418394327e-25
9.501620324205597399e+02 1.361493418383871996e-25
9.954047128664228694e+02 1.299611441273569427e-25
1.042801657599937016e+03 1.240542095527748252e-25
1.092455443536868643e+03 1.184157542710049173e-25
1.144473531870044098e+03 1.130335754838347063e-25
1.198968500637882016e+03 1.078960250290634106e-25
1.256058288366852139e+03 1.029919841714389472e-25
1.315866449315136606e+03 9.831083953938718176e-26
1.378522420869939197e+03 9.384246015545131412e-26
1.444161803677094440e+03 8.957717551073558514e-26
1.512926655109258263e+03 8.550575463589893171e-26
1.584965796707835807e+03 8.161938612340277441e-26
1.660435136263950653e+03 7.790965905778041364e-26
1.739498005235567007e+03 7.436854481265402856e-26
1.822325512230979484e+03 7.098837967510529479e-26
1.909096913323669696e+03 6.776184825979606151e-26
2.000000000000000000e+03 6.468196767694176365e-26
