# Frequency    Median mag            Median phase (Rad)    16th percentile mag   16th percentile phase 84th percentile mag   84th percentile phase
+1.0000000e+01 +1.0110815e+00 -1.2386381e-02 +9.5258006e-01 -3.1445688e-02 +1.0726329e+00 +7.7634453e-03
+1.0647838e+01 +1.0080713e+00 -1.3425447e-02 +9.5069506e-01 -2.7332995e-02 +1.0686409e+00 +1.5063212e-03
+1.1337646e+01 +1.0060016e+00 -1.3309577e-02 +9.5152775e-01 -2.5888389e-02 +1.0617768e+00 -1.6828678e-03
+1.2072142e+01 +1.0038489e+00 -1.3320543e-02 +9.5265652e-01 -2.7366540e-02 +1.0540581e+00 -3.8777835e-04
+1.2854222e+01 +1.0012464e+00 -1.3807695e-02 +9.5410639e-01 -2.9021290e-02 +1.0470923e+00 +2.7740403e-03
+1.3686967e+01 +9.9796922e-01 -1.3592945e-02 +9.5687975e-01 -3.0903765e-02 +1.0383777e+00 +6.9181207e-03
+1.4573661e+01 +9.9518270e-01 -1.2029971e-02 +9.6014796e-01 -3.1408704e-02 +1.0311601e+00 +1.0531319e-02
+1.5517799e+01 +9.9266991e-01 -1.0412059e-02 +9.6253680e-01 -3.1244784e-02 +1.0243326e+00 +1.3652752e-02
+1.6523101e+01 +9.9119751e-01 -8.0110587e-03 +9.6545222e-01 -3.1442613e-02 +1.0192328e+00 +1.6494150e-02
+1.7593531e+01 +9.8983482e-01 -5.7936114e-03 +9.6764464e-01 -3.0826991e-02 +1.0153080e+00 +2.0079888e-02
+1.8733307e+01 +9.8983237e-01 -3.7180923e-03 +9.6947343e-01 -3.0154326e-02 +1.0108736e+00 +2.3222620e-02
+1.9946923e+01 +9.8997743e-01 -1.9685413e-03 +9.7144844e-01 -2.8945196e-02 +1.0081742e+00 +2.5633804e-02
+2.1239161e+01 +9.8957911e-01 +4.4431279e-04 +9.7303684e-01 -2.8520099e-02 +1.0060494e+00 +2.8440415e-02
+2.2615115e+01 +9.9007510e-01 +2.2848484e-03 +9.7437074e-01 -2.6715399e-02 +1.0047226e+00 +3.0058032e-02
+2.4080208e+01 +9.8996640e-01 +3.4983317e-03 +9.7606247e-01 -2.5078242e-02 +1.0044423e+00 +3.1408145e-02
+2.5640216e+01 +9.9129510e-01 +4.2742624e-03 +9.7660291e-01 -2.4603582e-02 +1.0055496e+00 +3.3513817e-02
+2.7301288e+01 +9.9268768e-01 +5.7572619e-03 +9.7696455e-01 -2.3354287e-02 +1.0080345e+00 +3.3882485e-02
+2.9069970e+01 +9.9395609e-01 +5.8830832e-03 +9.7601058e-01 -2.1711409e-02 +1.0104964e+00 +3.4207205e-02
+3.0953234e+01 +9.9518651e-01 +6.7819483e-03 +9.7616616e-01 -2.0880216e-02 +1.0134068e+00 +3.4473096e-02
+3.2958502e+01 +9.9665326e-01 +6.5808284e-03 +9.7508743e-01 -1.9029979e-02 +1.0163796e+00 +3.4095205e-02
+3.5093680e+01 +9.9793291e-01 +6.3636899e-03 +9.7450383e-01 -1.8076131e-02 +1.0196637e+00 +3.2890919e-02
+3.7367183e+01 +9.9910162e-01 +5.8695135e-03 +9.7332875e-01 -1.6720117e-02 +1.0233897e+00 +3.1737055e-02
+3.9787972e+01 +9.9969046e-01 +6.0120767e-03 +9.7274418e-01 -1.5354392e-02 +1.0269466e+00 +3.0256289e-02
+4.2365590e+01 +1.0008151e+00 +5.5224710e-03 +9.7219901e-01 -1.4313169e-02 +1.0306077e+00 +2.7535957e-02
+4.5110195e+01 +1.0016043e+00 +4.9950521e-03 +9.7182624e-01 -1.3216788e-02 +1.0337205e+00 +2.4606273e-02
+4.8032606e+01 +1.0020360e+00 +4.2360410e-03 +9.7023234e-01 -1.2643330e-02 +1.0364817e+00 +2.2136107e-02
+5.1144342e+01 +1.0022255e+00 +3.1506149e-03 +9.6959442e-01 -1.2561236e-02 +1.0382511e+00 +1.9516832e-02
+5.4457668e+01 +1.0029456e+00 +2.3431914e-03 +9.6912691e-01 -1.3624610e-02 +1.0399394e+00 +1.7505758e-02
+5.7985644e+01 +1.0028663e+00 +7.6343962e-04 +9.6908037e-01 -1.5003881e-02 +1.0401988e+00 +1.6061567e-02
+6.1742176e+01 +1.0026584e+00 -8.7386696e-04 +9.6887020e-01 -1.7554549e-02 +1.0394460e+00 +1.5684745e-02
+6.5742070e+01 +1.0024780e+00 -2.3534094e-03 +9.6927436e-01 -2.0832116e-02 +1.0386648e+00 +1.6726234e-02
+7.0001093e+01 +1.0019811e+00 -3.6228487e-03 +9.7047173e-01 -2.4458755e-02 +1.0370242e+00 +1.8305971e-02
+7.4536032e+01 +1.0011883e+00 -4.8272667e-03 +9.7191407e-01 -2.8262710e-02 +1.0346885e+00 +1.9819268e-02
+7.9364761e+01 +1.0004698e+00 -5.0340172e-03 +9.7330983e-01 -3.2411375e-02 +1.0318720e+00 +2.1788869e-02
+8.4506314e+01 +9.9943415e-01 -4.9624107e-03 +9.7524214e-01 -3.5329244e-02 +1.0279031e+00 +2.3882489e-02
+8.9980956e+01 +9.9851880e-01 -5.6988001e-03 +9.7798178e-01 -3.7379392e-02 +1.0230301e+00 +2.5600992e-02
+9.5810267e+01 +9.9768961e-01 -5.8527179e-03 +9.8131003e-01 -3.9979010e-02 +1.0177604e+00 +2.6936603e-02
+1.0201722e+02 +9.9683406e-01 -5.0855341e-03 +9.8398157e-01 -4.1770075e-02 +1.0132560e+00 +2.8500988e-02
+1.0862629e+02 +9.9645691e-01 -4.6031182e-03 +9.8574547e-01 -4.1910805e-02 +1.0083985e+00 +2.9638256e-02
+1.1566352e+02 +9.9616637e-01 -3.6211679e-03 +9.8681834e-01 -4.1096652e-02 +1.0057853e+00 +3.0895574e-02
+1.2315664e+02 +9.9568753e-01 -2.7047661e-03 +9.8595842e-01 -3.9857266e-02 +1.0061427e+00 +3.0284592e-02
+1.3113520e+02 +9.9570322e-01 -2.1705336e-03 +9.8322273e-01 -3.7254208e-02 +1.0076083e+00 +2.9753861e-02
+1.3963064e+02 +9.9591099e-01 -1.7495630e-03 +9.8085160e-01 -3.4403826e-02 +1.0097740e+00 +2.7559124e-02
+1.4867645e+02 +9.9613703e-01 -9.9970749e-04 +9.7819398e-01 -3.1182033e-02 +1.0128670e+00 +2.6089694e-02
+1.5830827e+02 +9.9597034e-01 -3.8860007e-04 +9.7620771e-01 -2.7337855e-02 +1.0155843e+00 +2.3992416e-02
+1.6856409e+02 +9.9650464e-01 -5.9562034e-05 +9.7521422e-01 -2.3440570e-02 +1.0179106e+00 +2.1294688e-02
+1.7948432e+02 +9.9716849e-01 +7.5201528e-04 +9.7517028e-01 -1.9313311e-02 +1.0193002e+00 +1.8894438e-02
+1.9111200e+02 +9.9767577e-01 +6.3732119e-04 +9.7595227e-01 -1.5110795e-02 +1.0202815e+00 +1.6194669e-02
+2.0349296e+02 +9.9796094e-01 +8.6973699e-04 +9.7703265e-01 -1.2535306e-02 +1.0200466e+00 +1.3328414e-02
+2.1667602e+02 +9.9832836e-01 +9.7878803e-04 +9.7854496e-01 -1.0147194e-02 +1.0194028e+00 +1.1088228e-02
+2.3071312e+02 +9.9898928e-01 +1.4970849e-03 +9.8091448e-01 -8.2809368e-03 +1.0182215e+00 +9.7154280e-03
+2.4565960e+02 +9.9904026e-01 +1.5464537e-03 +9.8346434e-01 -7.1692280e-03 +1.0165044e+00 +8.8734194e-03
+2.6157437e+02 +9.9927786e-01 +1.5252296e-03 +9.8518778e-01 -6.5403722e-03 +1.0153413e+00 +8.5973781e-03
+2.7852016e+02 +9.9981632e-01 +1.3934179e-03 +9.8695114e-01 -6.2063159e-03 +1.0142475e+00 +8.4250218e-03
+2.9656376e+02 +1.0002554e+00 +1.3906426e-03 +9.8848924e-01 -6.0416638e-03 +1.0135701e+00 +8.3835886e-03
+3.1577629e+02 +1.0002293e+00 +1.3936576e-03 +9.8954972e-01 -6.1830213e-03 +1.0128284e+00 +8.3570875e-03
+3.3623349e+02 +1.0006404e+00 +1.3620968e-03 +9.9024752e-01 -6.1234219e-03 +1.0122582e+00 +8.0993034e-03
+3.5801598e+02 +1.0005505e+00 +1.3706764e-03 +9.9072238e-01 -6.2494737e-03 +1.0115976e+00 +8.4543787e-03
+3.8120963e+02 +1.0002447e+00 +1.4969682e-03 +9.9081608e-01 -6.4285057e-03 +1.0106845e+00 +8.9649824e-03
+4.0590584e+02 +1.0000752e+00 +1.5703171e-03 +9.9063045e-01 -6.3513257e-03 +1.0101486e+00 +9.4057206e-03
+4.3220198e+02 +1.0001226e+00 +2.7372478e-03 +9.9069400e-01 -6.4864086e-03 +1.0104805e+00 +1.1870626e-02
+4.6020168e+02 +1.0004458e+00 +2.8649655e-03 +9.9087076e-01 -6.1240047e-03 +1.0102199e+00 +1.2229515e-02
+4.9001530e+02 +1.0008390e+00 +2.8700131e-03 +9.9078023e-01 -5.8913389e-03 +1.0119601e+00 +1.1368036e-02
+5.2176037e+02 +1.0011009e+00 +3.0974722e-03 +9.9074343e-01 -5.8028444e-03 +1.0124252e+00 +1.1909755e-02
+5.5556200e+02 +1.0016292e+00 +2.9749667e-03 +9.9023532e-01 -5.9335479e-03 +1.0135191e+00 +1.1654508e-02
+5.9155343e+02 +1.0012063e+00 +3.0513523e-03 +9.9039069e-01 -5.7675315e-03 +1.0124050e+00 +1.2260001e-02
+6.2987653e+02 +1.0012359e+00 +3.5534014e-03 +9.9007670e-01 -6.4184819e-03 +1.0124939e+00 +1.3753756e-02
+6.7068234e+02 +1.0013704e+00 +4.0232939e-03 +9.8965567e-01 -6.5693867e-03 +1.0133554e+00 +1.5236028e-02
+7.1413171e+02 +1.0014512e+00 +4.2483615e-03 +9.8935180e-01 -6.9984870e-03 +1.0141203e+00 +1.6407837e-02
+7.6039589e+02 +1.0015539e+00 +4.3944508e-03 +9.8861587e-01 -7.5362542e-03 +1.0153807e+00 +1.7630804e-02
+8.0965725e+02 +1.0015358e+00 +4.7121283e-03 +9.8764979e-01 -8.2063016e-03 +1.0163776e+00 +1.8582471e-02
+8.6210994e+02 +1.0018312e+00 +4.7498906e-03 +9.8659271e-01 -9.0508801e-03 +1.0175503e+00 +1.9839333e-02
+9.1796072e+02 +1.0019641e+00 +4.9545131e-03 +9.8566421e-01 -1.0029569e-02 +1.0184206e+00 +2.0865899e-02
+9.7742973e+02 +1.0020039e+00 +5.2574003e-03 +9.8460393e-01 -1.0987799e-02 +1.0195224e+00 +2.2233810e-02
+1.0407514e+03 +1.0017924e+00 +5.5985251e-03 +9.8347702e-01 -1.2293312e-02 +1.0210607e+00 +2.3987540e-02
+1.1081752e+03 +1.0020708e+00 +5.7543003e-03 +9.8239430e-01 -1.3651106e-02 +1.0226171e+00 +2.5470524e-02
+1.1799671e+03 +1.0021502e+00 +6.1935983e-03 +9.8077085e-01 -1.5355299e-02 +1.0241614e+00 +2.7486739e-02
+1.2564098e+03 +1.0017970e+00 +6.7915013e-03 +9.7919274e-01 -1.6724751e-02 +1.0253408e+00 +2.9346481e-02
+1.3378049e+03 +1.0016969e+00 +7.1845515e-03 +9.7731431e-01 -1.7911263e-02 +1.0266139e+00 +3.1209145e-02
+1.4244730e+03 +1.0014758e+00 +7.5833123e-03 +9.7513910e-01 -1.9124009e-02 +1.0284905e+00 +3.3268997e-02
+1.5167558e+03 +1.0015699e+00 +8.0166137e-03 +9.7321059e-01 -2.0494631e-02 +1.0302724e+00 +3.5523270e-02
+1.6150171e+03 +1.0019599e+00 +7.9276360e-03 +9.7125488e-01 -2.2371240e-02 +1.0320778e+00 +3.7555079e-02
+1.7196440e+03 +1.0021381e+00 +8.3718024e-03 +9.6934517e-01 -2.4799059e-02 +1.0335654e+00 +3.9818865e-02
+1.8310492e+03 +1.0022362e+00 +8.2839659e-03 +9.6718075e-01 -2.6488766e-02 +1.0360582e+00 +4.2671631e-02
+1.9496715e+03 +1.0016276e+00 +8.8183295e-03 +9.6505346e-01 -2.8953628e-02 +1.0379523e+00 +4.5645886e-02
+2.0759787e+03 +1.0018937e+00 +9.3075137e-03 +9.6368034e-01 -3.1095976e-02 +1.0411413e+00 +4.7940800e-02
+2.2104686e+03 +1.0019228e+00 +9.7000345e-03 +9.6134200e-01 -3.2781907e-02 +1.0441093e+00 +5.0966607e-02
+2.3536712e+03 +1.0020844e+00 +1.0467235e-02 +9.5925222e-01 -3.5457548e-02 +1.0465580e+00 +5.3585108e-02
+2.5061510e+03 +1.0024742e+00 +1.1191643e-02 +9.5665984e-01 -3.8345186e-02 +1.0485615e+00 +5.6651134e-02
+2.6685090e+03 +1.0023201e+00 +1.1911358e-02 +9.5410492e-01 -4.0502650e-02 +1.0513540e+00 +5.9720428e-02
+2.8413853e+03 +1.0024274e+00 +1.2501594e-02 +9.5088342e-01 -4.2491270e-02 +1.0543121e+00 +6.3252680e-02
+3.0254611e+03 +1.0023407e+00 +1.3866360e-02 +9.4822530e-01 -4.4212075e-02 +1.0575052e+00 +6.7522710e-02
+3.2214620e+03 +1.0019388e+00 +1.3829172e-02 +9.4493918e-01 -4.6707274e-02 +1.0609002e+00 +7.0678122e-02
+3.4301607e+03 +1.0018299e+00 +1.4701039e-02 +9.4274254e-01 -4.8769681e-02 +1.0642767e+00 +7.4108492e-02
+3.6523796e+03 +1.0013437e+00 +1.4870777e-02 +9.3958636e-01 -5.1533617e-02 +1.0677908e+00 +7.6533289e-02
+3.8889947e+03 +1.0007752e+00 +1.5228299e-02 +9.3617628e-01 -5.4430888e-02 +1.0724118e+00 +8.0355512e-02
+4.1409387e+03 +1.0003753e+00 +1.5470343e-02 +9.3387713e-01 -5.7822652e-02 +1.0762663e+00 +8.3515900e-02
+4.4092045e+03 +9.9986687e-01 +1.5838427e-02 +9.3115081e-01 -6.1096794e-02 +1.0797714e+00 +8.7164203e-02
+4.6948497e+03 +9.9978208e-01 +1.6541452e-02 +9.2922397e-01 -6.2915063e-02 +1.0839700e+00 +9.0702797e-02
+4.9990000e+03 +1.0005840e+00 +1.6741588e-02 +9.2603265e-01 -6.5600473e-02 +1.0885320e+00 +9.4819656e-02
