# Frequency    Median mag            Median phase (Rad)    16th percentile mag   16th percentile phase 84th percentile mag   84th percentile phase
+1.0000000e+01 +1.0119780e+00 -1.2008594e-02 +9.3550862e-01 -4.1479273e-02 +1.0867698e+00 +1.5479534e-02
+1.0647838e+01 +1.0087166e+00 -1.2766552e-02 +9.3737950e-01 -3.5224386e-02 +1.0827656e+00 +9.2371945e-03
+1.1337646e+01 +1.0060857e+00 -1.2983095e-02 +9.3760195e-01 -3.4857583e-02 +1.0781879e+00 +6.7188760e-03
+1.2072142e+01 +1.0045902e+00 -1.3793793e-02 +9.3894076e-01 -3.6135077e-02 +1.0706009e+00 +9.4689065e-03
+1.2854222e+01 +1.0018044e+00 -1.3361187e-02 +9.4069909e-01 -3.8183796e-02 +1.0622871e+00 +1.2139272e-02
+1.3686967e+01 +9.9970642e-01 -1.2270780e-02 +9.4393504e-01 -4.1734766e-02 +1.0536502e+00 +1.5944463e-02
+1.4573661e+01 +9.9729068e-01 -1.2155325e-02 +9.4747786e-01 -4.3842231e-02 +1.0440157e+00 +1.9527290e-02
+1.5517799e+01 +9.9442195e-01 -1.0650181e-02 +9.5112809e-01 -4.4786380e-02 +1.0369856e+00 +2.2605133e-02
+1.6523101e+01 +9.9150097e-01 -9.6061462e-03 +9.5485065e-01 -4.4240753e-02 +1.0308477e+00 +2.5201857e-02
+1.7593531e+01 +9.8998494e-01 -8.5875713e-03 +9.5830784e-01 -4.4119098e-02 +1.0254194e+00 +2.7873140e-02
+1.8733307e+01 +9.8931556e-01 -6.7613906e-03 +9.5994626e-01 -4.2294898e-02 +1.0211865e+00 +3.1163773e-02
+1.9946923e+01 +9.8853559e-01 -5.0565010e-03 +9.6155873e-01 -4.0345593e-02 +1.0189922e+00 +3.3601519e-02
+2.1239161e+01 +9.8909187e-01 -2.7747124e-03 +9.6255388e-01 -3.8730221e-02 +1.0170993e+00 +3.5769110e-02
+2.2615115e+01 +9.8898999e-01 -5.1609158e-04 +9.6277339e-01 -3.6897661e-02 +1.0170712e+00 +3.6558934e-02
+2.4080208e+01 +9.8969962e-01 +1.8496903e-03 +9.6217285e-01 -3.5468966e-02 +1.0176087e+00 +3.8368732e-02
+2.5640216e+01 +9.9000106e-01 +3.0705946e-03 +9.6194092e-01 -3.4668359e-02 +1.0174895e+00 +4.0323127e-02
+2.7301288e+01 +9.9106387e-01 +4.6598045e-03 +9.6172530e-01 -3.1363128e-02 +1.0193824e+00 +4.1485425e-02
+2.9069970e+01 +9.9206273e-01 +5.8563352e-03 +9.6074397e-01 -2.9341696e-02 +1.0224242e+00 +4.2536865e-02
+3.0953234e+01 +9.9317807e-01 +5.9217781e-03 +9.5913922e-01 -2.8699897e-02 +1.0260904e+00 +4.2782417e-02
+3.2958502e+01 +9.9501246e-01 +6.3167781e-03 +9.5807847e-01 -2.7128259e-02 +1.0275771e+00 +4.2814803e-02
+3.5093680e+01 +9.9610047e-01 +7.1446786e-03 +9.5829063e-01 -2.6088642e-02 +1.0308646e+00 +4.1347495e-02
+3.7367183e+01 +9.9719370e-01 +8.0528360e-03 +9.5702785e-01 -2.2991182e-02 +1.0343226e+00 +4.0065583e-02
+3.9787972e+01 +9.9866145e-01 +8.7863613e-03 +9.5529376e-01 -2.0696668e-02 +1.0371786e+00 +3.9317045e-02
+4.2365590e+01 +9.9896698e-01 +9.7376291e-03 +9.5413618e-01 -1.9006705e-02 +1.0402700e+00 +3.7616887e-02
+4.5110195e+01 +9.9940783e-01 +1.0097926e-02 +9.5437232e-01 -1.7334994e-02 +1.0427124e+00 +3.5479302e-02
+4.8032606e+01 +9.9983365e-01 +9.9110905e-03 +9.5458920e-01 -1.6359056e-02 +1.0458724e+00 +3.3093372e-02
+5.1144342e+01 +1.0014363e+00 +8.8381312e-03 +9.5423951e-01 -1.4069045e-02 +1.0484075e+00 +3.1634256e-02
+5.4457668e+01 +1.0024007e+00 +9.1872707e-03 +9.5376779e-01 -1.3841934e-02 +1.0506642e+00 +3.1487641e-02
+5.7985644e+01 +1.0027599e+00 +9.2756919e-03 +9.5477167e-01 -1.5041540e-02 +1.0515108e+00 +3.0976982e-02
+6.1742176e+01 +1.0028651e+00 +8.8276068e-03 +9.5647879e-01 -1.7007373e-02 +1.0524402e+00 +3.2778154e-02
+6.5742070e+01 +1.0045829e+00 +8.2952537e-03 +9.5784035e-01 -2.1026307e-02 +1.0514682e+00 +3.5640760e-02
+7.0001093e+01 +1.0055913e+00 +7.3249903e-03 +9.5848962e-01 -2.4489671e-02 +1.0499517e+00 +3.9148226e-02
+7.4536032e+01 +1.0052038e+00 +6.0784605e-03 +9.6281783e-01 -2.9005188e-02 +1.0478578e+00 +4.3029136e-02
+7.9364761e+01 +1.0052266e+00 +4.9558046e-03 +9.6718624e-01 -3.4054357e-02 +1.0451916e+00 +4.6336481e-02
+8.4506314e+01 +1.0058724e+00 +4.6976276e-03 +9.7172416e-01 -3.9430747e-02 +1.0413552e+00 +4.9679107e-02
+8.9980956e+01 +1.0059569e+00 +4.0349555e-03 +9.7652041e-01 -4.4222320e-02 +1.0361960e+00 +5.1953231e-02
+9.5810267e+01 +1.0072060e+00 +2.4572128e-03 +9.8224784e-01 -4.8597039e-02 +1.0321810e+00 +5.3437917e-02
+1.0201722e+02 +1.0069260e+00 +9.5354326e-04 +9.8777016e-01 -5.1899663e-02 +1.0269627e+00 +5.5080961e-02
+1.0862629e+02 +1.0070676e+00 -5.8591461e-04 +9.9169807e-01 -5.3563621e-02 +1.0222175e+00 +5.5053676e-02
+1.1566352e+02 +1.0071668e+00 -1.6518017e-03 +9.9379616e-01 -5.4026496e-02 +1.0200978e+00 +5.4582161e-02
+1.2315664e+02 +1.0067549e+00 -1.3760252e-03 +9.9353077e-01 -5.2003550e-02 +1.0205818e+00 +5.2862050e-02
+1.3113520e+02 +1.0053600e+00 -2.2450376e-03 +9.8986249e-01 -4.9729707e-02 +1.0234689e+00 +4.9780421e-02
+1.3963064e+02 +1.0045108e+00 -2.5499666e-03 +9.8479663e-01 -4.6938654e-02 +1.0279080e+00 +4.6265857e-02
+1.4867645e+02 +1.0048005e+00 -3.9406460e-03 +9.8075491e-01 -4.4783198e-02 +1.0322821e+00 +4.1633600e-02
+1.5830827e+02 +1.0045472e+00 -4.6267654e-03 +9.7704870e-01 -4.1877825e-02 +1.0359508e+00 +3.6119228e-02
+1.6856409e+02 +1.0041592e+00 -4.4504187e-03 +9.7382492e-01 -3.7506191e-02 +1.0376456e+00 +3.0323520e-02
+1.7948432e+02 +1.0031959e+00 -4.8996952e-03 +9.7105552e-01 -3.3990995e-02 +1.0379676e+00 +2.5175537e-02
+1.9111200e+02 +1.0018177e+00 -5.4102738e-03 +9.6976966e-01 -2.9629420e-02 +1.0374410e+00 +1.9756388e-02
+2.0349296e+02 +1.0012628e+00 -5.2016440e-03 +9.6944412e-01 -2.4979058e-02 +1.0361164e+00 +1.5945593e-02
+2.1667602e+02 +1.0005323e+00 -5.1595306e-03 +9.7039102e-01 -2.1206613e-02 +1.0338591e+00 +1.2518631e-02
+2.3071312e+02 +9.9987816e-01 -4.8283993e-03 +9.7133654e-01 -1.8561743e-02 +1.0309222e+00 +1.0265093e-02
+2.4565960e+02 +9.9947181e-01 -4.3923800e-03 +9.7430371e-01 -1.6533301e-02 +1.0266717e+00 +8.5808313e-03
+2.6157437e+02 +9.9935310e-01 -3.7447538e-03 +9.7694858e-01 -1.5132652e-02 +1.0243783e+00 +7.5959637e-03
+2.7852016e+02 +9.9973222e-01 -3.5785476e-03 +9.7982823e-01 -1.4327065e-02 +1.0217137e+00 +7.5470307e-03
+2.9656376e+02 +9.9991649e-01 -3.5834725e-03 +9.8234281e-01 -1.3848303e-02 +1.0199073e+00 +7.6065646e-03
+3.1577629e+02 +1.0003435e+00 -3.3352047e-03 +9.8422166e-01 -1.3827032e-02 +1.0186193e+00 +7.5973276e-03
+3.3623349e+02 +1.0007683e+00 -3.5241671e-03 +9.8635079e-01 -1.4220884e-02 +1.0167923e+00 +7.7174971e-03
+3.5801598e+02 +1.0009733e+00 -3.7115608e-03 +9.8712068e-01 -1.4546833e-02 +1.0155423e+00 +7.8586038e-03
+3.8120963e+02 +1.0014215e+00 -3.8260942e-03 +9.8814614e-01 -1.4735470e-02 +1.0145585e+00 +7.8565727e-03
+4.0590584e+02 +1.0014003e+00 -3.8895828e-03 +9.8916942e-01 -1.4955413e-02 +1.0144277e+00 +7.9281711e-03
+4.3220198e+02 +1.0026884e+00 -3.4311074e-03 +9.9042839e-01 -1.7080637e-02 +1.0158156e+00 +9.7479425e-03
+4.6020168e+02 +1.0031638e+00 -3.0426270e-03 +9.9151288e-01 -1.6440692e-02 +1.0160021e+00 +1.0275919e-02
+4.9001530e+02 +1.0031252e+00 -4.8497056e-03 +9.8968727e-01 -1.7798773e-02 +1.0165768e+00 +7.7023741e-03
+5.2176037e+02 +1.0032550e+00 -5.2182428e-03 +9.8938115e-01 -1.8395720e-02 +1.0171364e+00 +7.7724730e-03
+5.5556200e+02 +1.0035473e+00 -6.3337111e-03 +9.8706091e-01 -1.9171287e-02 +1.0185051e+00 +6.3912116e-03
+5.9155343e+02 +1.0024891e+00 -5.8233335e-03 +9.8838766e-01 -1.8629317e-02 +1.0172854e+00 +7.0370880e-03
+6.2987653e+02 +1.0028677e+00 -5.8146033e-03 +9.8867994e-01 -1.9827201e-02 +1.0180730e+00 +7.7894429e-03
+6.7068234e+02 +1.0037029e+00 -6.3543888e-03 +9.8822707e-01 -2.1313212e-02 +1.0195113e+00 +8.5270044e-03
+7.1413171e+02 +1.0038643e+00 -7.2647219e-03 +9.8827498e-01 -2.2784971e-02 +1.0212842e+00 +9.3016986e-03
+7.6039589e+02 +1.0043364e+00 -7.9173215e-03 +9.8746859e-01 -2.4460322e-02 +1.0225163e+00 +9.9050960e-03
+8.0965725e+02 +1.0044065e+00 -8.2496970e-03 +9.8651096e-01 -2.5887395e-02 +1.0244229e+00 +1.0604316e-02
+8.6210994e+02 +1.0044084e+00 -8.7874212e-03 +9.8534820e-01 -2.7799315e-02 +1.0264376e+00 +1.1345432e-02
+9.1796072e+02 +1.0043605e+00 -9.4884058e-03 +9.8398162e-01 -2.9675586e-02 +1.0278536e+00 +1.1951785e-02
+9.7742973e+02 +1.0049055e+00 -9.6970993e-03 +9.8319263e-01 -3.1666509e-02 +1.0300422e+00 +1.2736800e-02
+1.0407514e+03 +1.0049328e+00 -1.0449402e-02 +9.8185254e-01 -3.3717454e-02 +1.0325989e+00 +1.3828083e-02
+1.1081752e+03 +1.0051568e+00 -1.0931426e-02 +9.8065954e-01 -3.6327729e-02 +1.0341241e+00 +1.4963564e-02
+1.1799671e+03 +1.0056156e+00 -1.1584513e-02 +9.7862822e-01 -3.8889354e-02 +1.0364519e+00 +1.6261903e-02
+1.2564098e+03 +1.0059257e+00 -1.1972145e-02 +9.7709332e-01 -4.1715681e-02 +1.0390191e+00 +1.7785670e-02
+1.3378049e+03 +1.0062606e+00 -1.2537147e-02 +9.7475541e-01 -4.5181503e-02 +1.0416677e+00 +1.8653503e-02
+1.4244730e+03 +1.0064454e+00 -1.3353916e-02 +9.7227262e-01 -4.8537419e-02 +1.0437444e+00 +2.0472680e-02
+1.5167558e+03 +1.0065446e+00 -1.4217900e-02 +9.7080722e-01 -5.1545997e-02 +1.0463031e+00 +2.2136286e-02
+1.6150171e+03 +1.0072492e+00 -1.5015587e-02 +9.6837377e-01 -5.5331584e-02 +1.0492729e+00 +2.3116425e-02
+1.7196440e+03 +1.0080085e+00 -1.5480029e-02 +9.6676672e-01 -5.8536471e-02 +1.0516255e+00 +2.3464011e-02
+1.8310492e+03 +1.0091014e+00 -1.6045654e-02 +9.6435738e-01 -6.1410699e-02 +1.0542930e+00 +2.5126843e-02
+1.9496715e+03 +1.0095467e+00 -1.7084794e-02 +9.6236989e-01 -6.4910899e-02 +1.0575572e+00 +2.5641245e-02
+2.0759787e+03 +1.0099178e+00 -1.8249406e-02 +9.5997336e-01 -6.8385447e-02 +1.0598782e+00 +2.6846395e-02
+2.2104686e+03 +1.0105912e+00 -1.9593634e-02 +9.5815462e-01 -7.2735204e-02 +1.0619087e+00 +2.7902384e-02
+2.3536712e+03 +1.0111429e+00 -2.0568936e-02 +9.5573453e-01 -7.6515996e-02 +1.0658748e+00 +2.9450984e-02
+2.5061510e+03 +1.0121154e+00 -2.1574848e-02 +9.5248837e-01 -8.0866548e-02 +1.0699622e+00 +3.0073033e-02
+2.6685090e+03 +1.0130477e+00 -2.2778537e-02 +9.5059508e-01 -8.5251098e-02 +1.0733876e+00 +3.0895462e-02
+2.8413853e+03 +1.0137807e+00 -2.4347806e-02 +9.4855680e-01 -9.0411175e-02 +1.0771072e+00 +3.1713634e-02
+3.0254611e+03 +1.0144560e+00 -2.5662717e-02 +9.4627443e-01 -9.5345186e-02 +1.0813273e+00 +3.2476307e-02
+3.2214620e+03 +1.0155126e+00 -2.6951320e-02 +9.4354296e-01 -1.0096927e-01 +1.0865052e+00 +3.3702957e-02
+3.4301607e+03 +1.0161101e+00 -2.8987449e-02 +9.4227562e-01 -1.0608459e-01 +1.0912456e+00 +3.5458912e-02
+3.6523796e+03 +1.0165736e+00 -3.0806096e-02 +9.3876596e-01 -1.1060365e-01 +1.0949928e+00 +3.5291298e-02
+3.8889947e+03 +1.0172212e+00 -3.3023701e-02 +9.3630289e-01 -1.1589597e-01 +1.0995033e+00 +3.5833120e-02
+4.1409387e+03 +1.0178744e+00 -3.5865858e-02 +9.3364039e-01 -1.2246559e-01 +1.1035799e+00 +3.6380199e-02
+4.4092045e+03 +1.0192005e+00 -3.8917027e-02 +9.3118510e-01 -1.2932815e-01 +1.1085616e+00 +3.6710423e-02
+4.6948497e+03 +1.0192544e+00 -4.2081339e-02 +9.2861953e-01 -1.3447195e-01 +1.1143896e+00 +3.7310814e-02
+4.9990000e+03 +1.0197020e+00 -4.5268571e-02 +9.2682347e-01 -1.4145245e-01 +1.1186877e+00 +3.8696955e-02
