# Frequency    Median mag            Median phase (Rad)    16th percentile mag   16th percentile phase 84th percentile mag   84th percentile phase
+1.0000000e+01 +1.0049426e+00 -1.2619798e-02 +9.2951385e-01 -3.9012434e-02 +1.0783836e+00 +1.3425729e-02
+1.0647838e+01 +1.0028794e+00 -1.2960192e-02 +9.2961280e-01 -3.3632500e-02 +1.0738350e+00 +9.8041412e-03
+1.1337646e+01 +1.0008061e+00 -1.2696953e-02 +9.3151728e-01 -3.2253822e-02 +1.0678232e+00 +9.3444656e-03
+1.2072142e+01 +9.9940432e-01 -1.1340972e-02 +9.3453884e-01 -3.3234373e-02 +1.0611092e+00 +1.1824086e-02
+1.2854222e+01 +9.9730050e-01 -1.0689290e-02 +9.3841875e-01 -3.6499331e-02 +1.0528967e+00 +1.6764744e-02
+1.3686967e+01 +9.9557016e-01 -9.7521438e-03 +9.4422110e-01 -3.8673165e-02 +1.0444579e+00 +2.0617259e-02
+1.4573661e+01 +9.9351061e-01 -8.5295867e-03 +9.4986499e-01 -4.0465724e-02 +1.0367690e+00 +2.4826846e-02
+1.5517799e+01 +9.9192836e-01 -7.6657254e-03 +9.5306301e-01 -4.0773822e-02 +1.0319936e+00 +2.8591813e-02
+1.6523101e+01 +9.9205055e-01 -6.1540141e-03 +9.5630083e-01 -4.0819645e-02 +1.0273170e+00 +3.1067171e-02
+1.7593531e+01 +9.9165588e-01 -4.6763830e-03 +9.5811728e-01 -4.1465068e-02 +1.0237608e+00 +3.2656140e-02
+1.8733307e+01 +9.9078951e-01 -2.9973635e-03 +9.6037986e-01 -3.8381599e-02 +1.0214243e+00 +3.4888633e-02
+1.9946923e+01 +9.9089984e-01 -1.9040130e-03 +9.6186846e-01 -3.7202322e-02 +1.0193595e+00 +3.6824034e-02
+2.1239161e+01 +9.9047142e-01 -3.6707900e-04 +9.6328958e-01 -3.5396125e-02 +1.0188137e+00 +3.7621607e-02
+2.2615115e+01 +9.9124040e-01 +5.8835370e-04 +9.6408951e-01 -3.4595644e-02 +1.0192681e+00 +3.9637482e-02
+2.4080208e+01 +9.9246122e-01 +2.0364172e-03 +9.6465291e-01 -3.3787672e-02 +1.0203327e+00 +4.0940498e-02
+2.5640216e+01 +9.9356598e-01 +2.8103262e-03 +9.6488783e-01 -3.2565893e-02 +1.0212606e+00 +4.2877370e-02
+2.7301288e+01 +9.9403339e-01 +4.1304006e-03 +9.6516471e-01 -3.0426031e-02 +1.0242407e+00 +4.3404407e-02
+2.9069970e+01 +9.9490058e-01 +5.1678217e-03 +9.6428809e-01 -2.8953310e-02 +1.0260822e+00 +4.2000433e-02
+3.0953234e+01 +9.9575865e-01 +5.8484479e-03 +9.6383502e-01 -2.7131758e-02 +1.0284679e+00 +4.1695369e-02
+3.2958502e+01 +9.9580440e-01 +6.5800686e-03 +9.6365951e-01 -2.6359979e-02 +1.0308240e+00 +4.0206620e-02
+3.5093680e+01 +9.9631052e-01 +6.8269812e-03 +9.6148174e-01 -2.6320953e-02 +1.0336627e+00 +3.9270375e-02
+3.7367183e+01 +9.9757218e-01 +6.6084731e-03 +9.5990591e-01 -2.5680413e-02 +1.0377734e+00 +3.8180269e-02
+3.9787972e+01 +9.9899992e-01 +7.2008997e-03 +9.5806647e-01 -2.4982645e-02 +1.0422802e+00 +3.6683682e-02
+4.2365590e+01 +1.0007373e+00 +7.3861942e-03 +9.5739966e-01 -2.3489708e-02 +1.0443499e+00 +3.4280185e-02
+4.5110195e+01 +1.0021874e+00 +6.6440819e-03 +9.5654043e-01 -2.1964995e-02 +1.0479816e+00 +3.2130242e-02
+4.8032606e+01 +1.0033188e+00 +5.3133227e-03 +9.5638874e-01 -2.0818988e-02 +1.0503145e+00 +3.0479282e-02
+5.1144342e+01 +1.0038943e+00 +4.8791178e-03 +9.5498776e-01 -2.0123890e-02 +1.0525066e+00 +2.7894428e-02
+5.4457668e+01 +1.0039028e+00 +4.1156111e-03 +9.5231281e-01 -1.9751267e-02 +1.0541460e+00 +2.6200524e-02
+5.7985644e+01 +1.0030911e+00 +2.8757670e-03 +9.5300011e-01 -2.1311040e-02 +1.0552736e+00 +2.5290472e-02
+6.1742176e+01 +1.0039697e+00 +1.2260245e-03 +9.5364113e-01 -2.3320813e-02 +1.0557050e+00 +2.6817173e-02
+6.5742070e+01 +1.0038080e+00 +1.8834192e-04 +9.5507992e-01 -2.6072930e-02 +1.0551744e+00 +2.8989164e-02
+7.0001093e+01 +1.0040488e+00 -8.7083971e-04 +9.5657444e-01 -3.2188116e-02 +1.0537078e+00 +3.3507833e-02
+7.4536032e+01 +1.0038935e+00 -1.5106349e-03 +9.5931940e-01 -3.7686851e-02 +1.0500671e+00 +3.7296533e-02
+7.9364761e+01 +1.0037796e+00 -2.3500664e-03 +9.6289690e-01 -4.2416638e-02 +1.0458475e+00 +4.0785531e-02
+8.4506314e+01 +1.0033199e+00 -2.6422465e-03 +9.6689761e-01 -4.7983761e-02 +1.0409208e+00 +4.3302008e-02
+8.9980956e+01 +1.0030205e+00 -3.6579502e-03 +9.7176876e-01 -5.2434117e-02 +1.0357603e+00 +4.5952827e-02
+9.5810267e+01 +1.0020279e+00 -4.5861938e-03 +9.7600343e-01 -5.5467186e-02 +1.0295358e+00 +4.8215259e-02
+1.0201722e+02 +1.0011279e+00 -5.0609126e-03 +9.8156945e-01 -5.8197409e-02 +1.0231668e+00 +5.0015178e-02
+1.0862629e+02 +1.0008570e+00 -5.8109361e-03 +9.8562330e-01 -5.9191078e-02 +1.0175962e+00 +5.0469127e-02
+1.1566352e+02 +1.0008988e+00 -6.4807829e-03 +9.8751480e-01 -6.0464767e-02 +1.0138542e+00 +5.1277874e-02
+1.2315664e+02 +9.9960161e-01 -6.6439815e-03 +9.8627543e-01 -6.0879642e-02 +1.0132705e+00 +4.9215462e-02
+1.3113520e+02 +9.9834252e-01 -6.7890913e-03 +9.8200479e-01 -5.8913368e-02 +1.0166399e+00 +4.6811509e-02
+1.3963064e+02 +9.9648360e-01 -6.5515819e-03 +9.7719591e-01 -5.5550312e-02 +1.0210407e+00 +4.3993518e-02
+1.4867645e+02 +9.9547862e-01 -6.4998743e-03 +9.7193013e-01 -5.0664889e-02 +1.0248468e+00 +4.0732778e-02
+1.5830827e+02 +9.9491666e-01 -6.3269808e-03 +9.6806469e-01 -4.5823687e-02 +1.0276110e+00 +3.6107867e-02
+1.6856409e+02 +9.9461015e-01 -6.2128407e-03 +9.6447338e-01 -3.8772790e-02 +1.0299477e+00 +3.1635840e-02
+1.7948432e+02 +9.9435316e-01 -5.5593098e-03 +9.6309626e-01 -3.3325417e-02 +1.0305780e+00 +2.6448819e-02
+1.9111200e+02 +9.9423513e-01 -3.9839994e-03 +9.6274790e-01 -2.7651675e-02 +1.0308681e+00 +2.0741203e-02
+2.0349296e+02 +9.9394681e-01 -3.7556171e-03 +9.6338849e-01 -2.3533618e-02 +1.0291087e+00 +1.6849180e-02
+2.1667602e+02 +9.9457488e-01 -3.0859112e-03 +9.6515733e-01 -1.9650307e-02 +1.0265795e+00 +1.3715862e-02
+2.3071312e+02 +9.9502997e-01 -2.2417740e-03 +9.6830780e-01 -1.6608668e-02 +1.0233499e+00 +1.1427960e-02
+2.4565960e+02 +9.9478346e-01 -2.0784740e-03 +9.7108418e-01 -1.4856878e-02 +1.0211101e+00 +9.5900380e-03
+2.6157437e+02 +9.9503305e-01 -1.9028379e-03 +9.7392526e-01 -1.3259119e-02 +1.0183462e+00 +9.2152783e-03
+2.7852016e+02 +9.9613032e-01 -1.8449239e-03 +9.7677854e-01 -1.2303768e-02 +1.0162309e+00 +8.9261484e-03
+2.9656376e+02 +9.9679505e-01 -1.7539546e-03 +9.7955721e-01 -1.2381406e-02 +1.0146873e+00 +8.6873734e-03
+3.1577629e+02 +9.9734676e-01 -1.9565855e-03 +9.8203699e-01 -1.2516221e-02 +1.0130999e+00 +8.5074606e-03
+3.3623349e+02 +9.9765144e-01 -2.4477484e-03 +9.8354861e-01 -1.2966766e-02 +1.0124985e+00 +8.1018639e-03
+3.5801598e+02 +9.9808236e-01 -2.8514398e-03 +9.8492371e-01 -1.3315013e-02 +1.0115999e+00 +7.7030653e-03
+3.8120963e+02 +9.9842473e-01 -3.1007730e-03 +9.8615083e-01 -1.3659494e-02 +1.0106581e+00 +7.4749105e-03
+4.0590584e+02 +9.9819017e-01 -3.3093001e-03 +9.8692560e-01 -1.4204554e-02 +1.0105271e+00 +7.9960411e-03
+4.3220198e+02 +9.9888798e-01 -3.4776739e-03 +9.8777664e-01 -1.5651804e-02 +1.0112020e+00 +8.8497275e-03
+4.6020168e+02 +9.9935804e-01 -3.7109158e-03 +9.8879635e-01 -1.5346557e-02 +1.0111056e+00 +8.9473466e-03
+4.9001530e+02 +9.9922165e-01 -4.7017213e-03 +9.8670049e-01 -1.5885365e-02 +1.0121747e+00 +7.3091681e-03
+5.2176037e+02 +9.9959905e-01 -4.7996760e-03 +9.8718997e-01 -1.6459728e-02 +1.0125686e+00 +7.6934229e-03
+5.5556200e+02 +9.9940665e-01 -5.9361493e-03 +9.8563147e-01 -1.7020408e-02 +1.0129838e+00 +6.2141079e-03
+5.9155343e+02 +9.9905568e-01 -5.8101104e-03 +9.8684939e-01 -1.6851018e-02 +1.0129619e+00 +6.8538320e-03
+6.2987653e+02 +9.9980317e-01 -6.1192421e-03 +9.8683598e-01 -1.8589127e-02 +1.0133412e+00 +7.4277453e-03
+6.7068234e+02 +1.0000338e+00 -6.5577536e-03 +9.8643097e-01 -2.0136620e-02 +1.0146197e+00 +7.7684135e-03
+7.1413171e+02 +1.0002045e+00 -7.2184302e-03 +9.8566312e-01 -2.1449468e-02 +1.0155222e+00 +7.7243895e-03
+7.6039589e+02 +1.0004695e+00 -7.6953520e-03 +9.8460829e-01 -2.3393763e-02 +1.0165950e+00 +8.0516577e-03
+8.0965725e+02 +1.0005162e+00 -8.4125331e-03 +9.8322022e-01 -2.5474377e-02 +1.0180278e+00 +8.2775556e-03
+8.6210994e+02 +1.0005900e+00 -9.1350238e-03 +9.8192740e-01 -2.7675053e-02 +1.0197767e+00 +9.2141555e-03
+9.1796072e+02 +1.0007888e+00 -9.5294347e-03 +9.8090702e-01 -2.9596177e-02 +1.0214028e+00 +9.8654823e-03
+9.7742973e+02 +1.0014819e+00 -9.8534954e-03 +9.7996149e-01 -3.1440845e-02 +1.0234922e+00 +1.0926364e-02
+1.0407514e+03 +1.0019942e+00 -1.0270280e-02 +9.7809798e-01 -3.3655448e-02 +1.0245938e+00 +1.2251736e-02
+1.1081752e+03 +1.0017343e+00 -1.0729988e-02 +9.7638594e-01 -3.6139690e-02 +1.0260976e+00 +1.3023109e-02
+1.1799671e+03 +1.0018247e+00 -1.1423413e-02 +9.7452586e-01 -3.8970666e-02 +1.0285460e+00 +1.4112128e-02
+1.2564098e+03 +1.0023446e+00 -1.2399289e-02 +9.7294702e-01 -4.1981676e-02 +1.0308839e+00 +1.5502796e-02
+1.3378049e+03 +1.0027169e+00 -1.2942271e-02 +9.7117150e-01 -4.5310671e-02 +1.0337309e+00 +1.6704867e-02
+1.4244730e+03 +1.0030460e+00 -1.3822186e-02 +9.6958822e-01 -4.7909124e-02 +1.0361423e+00 +1.7719004e-02
+1.5167558e+03 +1.0031141e+00 -1.4622192e-02 +9.6698278e-01 -5.1844926e-02 +1.0392702e+00 +1.9400099e-02
+1.6150171e+03 +1.0034263e+00 -1.5800023e-02 +9.6478386e-01 -5.4589994e-02 +1.0413594e+00 +2.1303107e-02
+1.7196440e+03 +1.0037934e+00 -1.6792147e-02 +9.6350496e-01 -5.8231859e-02 +1.0452818e+00 +2.2231031e-02
+1.8310492e+03 +1.0039782e+00 -1.8027920e-02 +9.6129814e-01 -6.2539177e-02 +1.0477447e+00 +2.3578754e-02
+1.9496715e+03 +1.0040796e+00 -1.9064145e-02 +9.5869671e-01 -6.6345647e-02 +1.0512690e+00 +2.4274420e-02
+2.0759787e+03 +1.0047657e+00 -2.0499614e-02 +9.5623733e-01 -7.0194370e-02 +1.0540262e+00 +2.6190208e-02
+2.2104686e+03 +1.0047998e+00 -2.2202567e-02 +9.5399929e-01 -7.3660205e-02 +1.0569006e+00 +2.7869479e-02
+2.3536712e+03 +1.0046911e+00 -2.4011248e-02 +9.5267432e-01 -7.7539764e-02 +1.0605982e+00 +2.9342895e-02
+2.5061510e+03 +1.0049531e+00 -2.5868187e-02 +9.5018619e-01 -8.1399342e-02 +1.0649419e+00 +3.1016802e-02
+2.6685090e+03 +1.0046412e+00 -2.7626125e-02 +9.4786061e-01 -8.6600220e-02 +1.0688980e+00 +3.2689161e-02
+2.8413853e+03 +1.0044919e+00 -2.9378888e-02 +9.4618244e-01 -9.0928123e-02 +1.0720004e+00 +3.3794451e-02
+3.0254611e+03 +1.0054995e+00 -3.2013040e-02 +9.4328678e-01 -9.6376770e-02 +1.0774594e+00 +3.5600745e-02
+3.2214620e+03 +1.0065253e+00 -3.3328847e-02 +9.4165496e-01 -1.0079971e-01 +1.0822744e+00 +3.6917835e-02
+3.4301607e+03 +1.0079385e+00 -3.5270242e-02 +9.3912394e-01 -1.0639998e-01 +1.0868463e+00 +3.8788691e-02
+3.6523796e+03 +1.0075347e+00 -3.7737981e-02 +9.3577765e-01 -1.1087619e-01 +1.0922758e+00 +4.1957799e-02
+3.8889947e+03 +1.0074904e+00 -4.0547936e-02 +9.3346056e-01 -1.1530115e-01 +1.0962489e+00 +4.4660775e-02
+4.1409387e+03 +1.0070603e+00 -4.3619217e-02 +9.3039574e-01 -1.2128250e-01 +1.1020135e+00 +4.6158302e-02
+4.4092045e+03 +1.0070899e+00 -4.6352606e-02 +9.2750507e-01 -1.2692310e-01 +1.1073596e+00 +4.7829781e-02
+4.6948497e+03 +1.0077494e+00 -4.8688883e-02 +9.2524353e-01 -1.3401195e-01 +1.1119725e+00 +4.8549590e-02
+4.9990000e+03 +1.0077329e+00 -5.1230363e-02 +9.2172060e-01 -1.4116385e-01 +1.1190697e+00 +5.0344293e-02
