2.000000000000000000e+01 3.591080948426263630e-45 2.722434105941673546e-46 2.181705366590758493e-46
2.109952716083550328e+01 2.717177282475416026e-45 2.115215377628774443e-46 1.455978554802821571e-46
2.225950232054175615e+01 2.356504534070183630e-45 1.863800600004960051e-46 1.104684498830010560e-46
2.348324868994759740e+01 1.615314193427139579e-45 1.278166643039731449e-46 7.392465352825494644e-47
2.477427217791020198e+01 1.153480453578500429e-45 9.479957958601931374e-47 5.310592212991941592e-47
2.613627143538737840e+01 9.051125343297730807e-46 7.796567244267566190e-47 3.582095248582089319e-47
2.757314845169625528e+01 5.308006212276619987e-46 5.102010932922772368e-47 2.226197019990235655e-47
2.908901973331572677e+01 4.584992958984622440e-46 4.814380407407688950e-47 1.746827185834509575e-47
3.068822809725876866e+01 2.977150534302356223e-46 3.329531920270255581e-47 1.081955780068801150e-47
3.237535511280132994e+01 1.906821991580179364e-46 2.260320226227051577e-47 7.721839759057286168e-48
3.415523422721231128e+01 1.403720657423829403e-46 1.727002499510806254e-47 6.254352949680532573e-48
3.603296461308822529e+01 5.638109326380711578e-47 7.955563848980732311e-48 4.466638119692892985e-48
3.801392577696397979e+01 2.275402539911745596e-47 4.267788465362432635e-48 3.309544451662181161e-48
4.010379297105183127e+01 3.004025766795792455e-48 2.859645162752853862e-48 2.837326026916382302e-48
4.230855345226157738e+01 -9.904195029390608193e-48 2.808519206143801437e-48 2.568541742252669053e-48
4.463452363508271503e+01 -1.068094720965428795e-47 2.621241998940298731e-48 2.305131310525153651e-48
4.708836718746909611e+01 -5.630971658468379362e-48 1.969814012607166142e-48 1.863594443059518191e-48
4.967711412156997142e+01 7.778575675994087808e-49 1.669073522603354297e-48 1.666805766742104754e-48
5.240818093399955302e+01 1.034718138347647300e-47 2.021902158893085223e-48 1.643107832487404553e-48
5.528939185334521511e+01 2.000273501267833235e-47 3.005171605027317905e-48 1.952876266616274308e-48
5.832900125578675699e+01 2.640648031267539235e-47 3.686662635923438337e-48 2.383084410813807238e-48
6.153571731304403869e+01 4.094709027493971455e-47 5.387243452369729203e-48 3.196608033019613926e-48
6.491872694040340264e+01 5.443432874771708378e-47 6.792660772593402376e-48 4.110704570058820478e-48
6.848772211629528783e+01 6.639394126104392484e-47 7.656000222310147312e-48 5.161272867672591909e-48
7.225292764882630081e+01 7.580292844148960772e-47 8.324147829050144297e-48 5.785585699415091268e-48
7.622513046881468313e+01 8.983966630464401950e-47 9.369861840902741275e-48 6.499813707013333154e-48
8.041571053324926766e+01 1.017892743510212023e-46 9.616256479136111147e-48 7.312827273890528457e-48
8.483667342770891651e+01 1.098111074448722398e-46 8.968719505889364185e-48 7.699280586694398656e-48
8.950068476114380189e+01 1.175776892769557148e-46 7.696162049729492331e-48 8.099427553033131425e-48
9.442110645155648285e+01 1.323601697020574254e-46 7.174852957563612435e-48 8.168585734959963958e-48
9.961203500653786591e+01 1.375688220228884648e-46 5.826280114784350381e-48 7.260721746037091227e-48
1.050883419083271804e+02 1.506503716586689309e-46 4.773774798951097460e-48 6.806313376740522159e-48
1.108657162190958019e+02 1.585771801580525745e-46 3.750357125049116246e-48 6.398743059773809588e-48
1.169607095285145846e+02 1.589505773327215174e-46 2.931080743373282652e-48 6.235823289639093890e-48
1.233907833723743153e+02 1.675165468845393571e-46 2.657642339481317658e-48 7.409152855170614599e-48
1.301743592581091491e+02 1.698910927715667520e-46 3.223061630127537915e-48 8.431449906359817724e-48
1.373308714405416993e+02 1.778757406909920125e-46 5.979987359159635514e-48 8.291091973791032875e-48
1.448808225990458141e+02 1.877480772962462134e-46 7.249862060482170091e-48 1.042305187662611302e-47
1.528458425756377892e+02 1.918946131668731506e-46 8.364472529913177800e-48 1.223487176951482928e-47
1.612487503422729276e+02 1.979605005228969288e-46 1.026399791275926066e-47 1.320694242722854902e-47
1.701136193748786241e+02 2.077663236803406078e-46 1.166664723135444615e-47 1.482162659329122963e-47
1.794658466214141015e+02 2.049069168444862667e-46 1.290565141644579401e-47 1.419281310755614436e-47
1.893322252615433570e+02 2.125263986778744342e-46 1.397203768970675483e-47 1.385731399504619118e-47
1.997410214663678971e+02 2.202402204687947506e-46 1.474361739046295756e-47 1.368765209769837146e-47
2.107220553781329215e+02 2.251597239810279105e-46 1.495401581876964912e-47 1.315927053658505474e-47
2.223067865419000384e+02 2.324829856114226953e-46 1.483239518502670002e-47 1.263572156847130864e-47
2.345284040339441276e+02 2.388470766089049851e-46 1.408053147797146101e-47 1.200521692300610006e-47
2.474219215450802096e+02 2.504452267337142646e-46 1.314090561106525682e-47 1.154455481755989281e-47
2.610242776913264038e+02 2.531498904593128888e-46 1.192291385329546677e-47 1.097423411864707567e-47
2.753744418392806210e+02 2.670652574218989353e-46 1.124596039578210513e-47 1.068813422360854799e-47
2.905135257493910217e+02 2.759080124355786584e-46 1.017051355842154838e-47 1.046927973482661470e-47
3.064849013569681802e+02 2.876881269739718790e-46 9.520077111176069329e-48 1.008988514310984429e-47
3.233343250283667771e+02 2.994677805119670000e-46 9.067427607706653994e-48 9.406591845379642946e-48
3.411100686483218283e+02 3.076992041566531599e-46 8.536679951834783536e-48 8.641108596054347911e-48
3.598630579139866086e+02 3.226325127766612290e-46 8.480173190725834698e-48 8.336254700737753485e-48
3.796470182318741990e+02 3.309767741733641764e-46 8.665483178969129069e-48 7.937488797169738035e-48
4.005186286356818073e+02 3.497989079100970908e-46 8.781714680508906171e-48 7.853347188896566168e-48
4.225376841659580691e+02 3.728489074751531047e-46 9.343011889911987724e-48 8.315300557614275400e-48
4.457672671768079908e+02 3.937433523778658051e-46 9.828862694350250842e-48 8.674555162210326513e-48
4.702739280604240548e+02 4.086604057806210162e-46 1.033076688485199331e-47 9.509919295963840021e-48
4.961278759071861941e+02 4.334754045529718074e-46 1.167178119646411490e-47 1.140058888978654950e-47
5.234031796475647980e+02 4.611952771637216015e-46 1.343763939138076604e-47 1.177602852441965281e-47
5.521779802520730982e+02 4.871786401903291704e-46 1.428999382373943535e-47 1.509312171692261446e-47
5.825347145971950340e+02 5.231639855233864046e-46 1.449953879875217661e-47 1.561383944001492086e-47
6.145603516386539695e+02 5.588938584173310702e-46 1.578259251973178943e-47 1.595941375239897793e-47
6.483466415686201572e+02 6.025036636757474983e-46 1.792377595978646862e-47 1.749268402401015058e-47
6.839903786706787514e+02 6.505788031843722822e-46 2.010714665444094240e-47 2.037124843643582806e-47
7.215936786256077085e+02 6.993303912633083938e-46 2.226784430538024324e-47 2.405223469673518071e-47
7.612642710624102165e+02 7.528310569517982780e-46 2.591049511030974581e-47 2.787420449299957125e-47
8.031158081927486592e+02 8.132297392310992270e-46 2.918894264434664295e-47 3.262261955973203269e-47
8.472681904129632358e+02 8.892294599973164660e-46 3.361985720852774687e-47 3.816988035523702278e-47
8.938479098065128028e+02 9.622488944337160417e-46 3.895043781591321599e-47 4.306084973815230515e-47
9.429884125309283718e+02 1.049807900878210500e-45 4.431543463615399677e-47 4.960733869666431260e-47
9.948304811274733765e+02 1.130765204932638995e-45 4.888581157639009926e-47 5.755683036580917492e-47
1.049522637848809154e+03 1.264902443809545104e-45 5.690406155643025886e-47 6.954252060431015032e-47
1.107221570160134206e+03 1.375384324016295637e-45 6.038701532514462542e-47 8.516514171101929917e-47
1.168092579632833576e+03 1.510117428209890444e-45 7.541068907599496792e-47 9.573545146705206392e-47
1.232310055516668172e+03 1.663374575811913916e-45 9.393480873799881422e-47 1.067724363390730326e-46
1.300057974347233085e+03 1.817794313070914793e-45 1.104500887730187405e-46 1.205185364124494964e-46
1.371530427020012212e+03 1.999254640210847164e-45 1.240553590733590300e-46 1.427110444855678089e-46
1.446932174841053666e+03 2.213945314653711499e-45 1.392341492893382768e-46 1.718314810369252512e-46
1.526479236147279153e+03 2.464362272343718086e-45 1.659426184637263817e-46 1.986925241843246313e-46
1.610399505177046422e+03 2.684710836149000590e-45 1.903779347519659048e-46 2.299036672075287464e-46
1.698933404963958083e+03 2.985454453240008878e-45 2.242442664206294086e-46 2.723667592148950769e-46
1.792334576124389741e+03 3.300989977923700023e-45 2.568008575540418907e-46 3.256272512551676874e-46
1.890870603512058324e+03 3.629853843032519649e-45 2.919750081183685323e-46 3.873710884382967101e-46
1.994823782821403483e+03 4.072119360017754166e-45 3.418538752242832942e-46 4.618455702071648996e-46
2.104491929336042176e+03 4.470455551258722010e-45 3.938232985392861048e-46 5.292764591625925928e-46
2.220189231139245749e+03 4.940321572522974479e-45 4.534466697470019865e-46 6.135413950142298517e-46
2.342247149230851392e+03 5.529347085695205480e-45 5.298319574846381261e-46 7.116698157767695730e-46
2.471015367129292372e+03 6.107487736680152971e-45 6.076973122811015828e-46 8.300223821412394009e-46
2.606862792679321956e+03 6.780929885533960947e-45 7.078254625917432623e-46 9.632439849672102075e-46
2.750178614935443875e+03 7.449283570039697184e-45 8.126675242573485702e-46 1.109312608603166266e-45
2.901373419148966150e+03 8.364348508887024069e-45 9.466128362324415668e-46 1.308049174445327578e-45
3.060880363052990560e+03 9.267360766914426031e-45 1.085976447007604987e-45 1.515955816598232636e-45
3.229156417815228906e+03 1.027686074199869463e-44 1.250105111100853483e-45 1.767785654257595140e-45
3.406683677213936335e+03 1.161836211062524150e-44 1.461649052023673172e-45 2.098178677397499668e-45
3.593970738787522805e+03 1.268182963453326857e-44 1.644715517287371333e-45 2.394731446403400879e-45
3.791554160914766726e+03 1.407947591894472856e-44 1.885860371481628512e-45 2.775239448441142246e-45
4.000000000000000000e+03 1.559521360065064670e-44 2.153819262469032226e-45 3.210152771555433191e-45
