lalmetaio: fix the zlib check

34 jobs for fix-lalmetaio-zlib-check in 107 minutes and 38 seconds (queued for 4 seconds)
Status Job ID Name Coverage
  Level0
passed #236520
documentation

00:05:25

passed #236522
level0:deb:lal

00:23:31

passed #236521
level0:rpm:lal

00:10:53

 
  Level1
passed #236526
level1:deb:lalframe

00:05:00

passed #236527
level1:deb:lalmetaio

00:05:32

passed #236528
level1:deb:lalsimulation

00:12:37

passed #236523
level1:rpm:lalframe

00:02:44

passed #236524
level1:rpm:lalmetaio

00:02:53

passed #236525
level1:rpm:lalsimulation

00:05:03

 
  Level2
passed #236532
level2:deb:lalburst

00:03:49

passed #236533
level2:deb:lalinspiral

00:18:40

passed #236534
level2:deb:lalpulsar

00:16:15

passed #236529
level2:rpm:lalburst

00:02:21

passed #236530
level2:rpm:lalinspiral

00:08:42

passed #236531
level2:rpm:lalpulsar

00:08:13

 
  Level3
passed #236536
level3:deb:lalinference

00:07:59

passed #236535
level3:rpm:lalinference

00:06:25

 
  Level4
passed #236538
level4:deb:lalapps

00:09:23

passed #236537
level4:rpm:lalapps

00:05:17

 
  Nightly
passed #236539
nightly:clang:6

00:34:53

passed #236540
nightly:clang:7

00:35:14

passed #236541
nightly:clang:8

00:35:19

failed #236545
allowed to fail
nightly:debian:buster

00:04:54

passed #236544
nightly:debian:jessie

00:34:33

passed #236542
nightly:gcc:7

00:31:54

failed #236543
allowed to fail
nightly:gcc:8

00:18:44

passed #236549
macos_elcapitan
nightly:macos:elcapitan

00:25:20

passed #236548
macos_highsierra
nightly:macos:highsierra

00:25:33

passed #236546
nightly:rhel:el7-cr

00:33:21

passed #236547
nightly:rhel:sl7

00:32:51

passed #236552
nightly:ubuntu:bionic

00:33:33

failed #236553
allowed to fail
nightly:ubuntu:cosmic

00:04:50

failed #236550
allowed to fail
nightly:ubuntu:trusty

00:11:28

failed #236551
allowed to fail
nightly:ubuntu:xenial

00:11:57

 
Name Stage Failure
failed
nightly:ubuntu:cosmic Nightly
make[4]: Leaving directory '/builds/adam-mercer/lalsuite/lalapps'
make[3]: *** [Makefile:744: distdir] Error 2
make[3]: Leaving directory '/builds/adam-mercer/lalsuite/lalapps'
make[2]: *** [Makefile:508: distdir-am] Error 1
make[2]: Leaving directory '/builds/adam-mercer/lalsuite'
make[1]: *** [Makefile:502: distdir] Error 2
make[1]: Leaving directory '/builds/adam-mercer/lalsuite'
make: *** [Makefile:603: dist] Error 2
ERROR: Job failed: exit code 1
failed
nightly:ubuntu:xenial Nightly
Makefile:416: recipe for target 'all-recursive' failed
make[2]: *** [all-recursive] Error 1
make[2]: Leaving directory '/builds/adam-mercer/lalsuite/lalsuite-6.50.1/_build/sub'
Makefile:353: recipe for target 'all' failed
make[1]: *** [all] Error 2
make[1]: Leaving directory '/builds/adam-mercer/lalsuite/lalsuite-6.50.1/_build/sub'
make: *** [distcheck] Error 1
Makefile:607: recipe for target 'distcheck' failed
ERROR: Job failed: exit code 1
failed
nightly:ubuntu:trusty Nightly
make[4]: Leaving directory `/builds/adam-mercer/lalsuite/lalsuite-6.50.1/_build/lalinspiral'
make[3]: *** [all] Error 2
make[3]: Leaving directory `/builds/adam-mercer/lalsuite/lalsuite-6.50.1/_build/lalinspiral'
make[2]: *** [all-recursive] Error 1
make[2]: Leaving directory `/builds/adam-mercer/lalsuite/lalsuite-6.50.1/_build'
make[1]: *** [all] Error 2
make[1]: Leaving directory `/builds/adam-mercer/lalsuite/lalsuite-6.50.1/_build'
make: *** [distcheck] Error 1
ERROR: Job failed: exit code 1
failed
nightly:debian:buster Nightly
make[4]: Leaving directory '/builds/adam-mercer/lalsuite/lalapps'
make[3]: *** [Makefile:744: distdir] Error 2
make[3]: Leaving directory '/builds/adam-mercer/lalsuite/lalapps'
make[2]: *** [Makefile:508: distdir-am] Error 1
make[2]: Leaving directory '/builds/adam-mercer/lalsuite'
make[1]: *** [Makefile:502: distdir] Error 2
make[1]: Leaving directory '/builds/adam-mercer/lalsuite'
make: *** [Makefile:603: dist] Error 2
ERROR: Job failed: exit code 1
failed
nightly:gcc:8 Nightly
make[2]: *** [all-recursive] Error 1
Makefile:416: recipe for target 'all-recursive' failed
make[2]: Leaving directory '/builds/adam-mercer/lalsuite/lalsuite-6.50.1/_build/sub'
make[1]: *** [all] Error 2
Makefile:353: recipe for target 'all' failed
make[1]: Leaving directory '/builds/adam-mercer/lalsuite/lalsuite-6.50.1/_build/sub'
Makefile:607: recipe for target 'distcheck' failed
make: *** [distcheck] Error 1
ERROR: Job failed: exit code 1